{"text_format":"1","workbook":"xlsx","n_sheets":23,"sheets":["NBR Frontpage","Information","Plan","Listor","Random Plan","db","Sprut plan Borg + Laxm","Sprut plan (övriga)","4 försök","Borg 101","St U 102","Alna 103","Laxm 104","Resl 105","Alnarp + Reslöv","Soil samples","Field protocol","102 RP1 St U (2)","105 RP1 Resl","104 RP1 Laxm","103 RP1 Alna","102 RP1 St U","101 RP1 Borg"],"not_rendered":{"charts":0,"images":1,"macros":1,"external_links":20,"defined_names":365,"comments":1,"pivot_tables":0},"unopened":[],"bounds":{"document_bytes":16777216,"sheet_cells":100000,"rows_first":2000,"rows_last":500,"rows_between":2000,"halvings":0,"cell_chars":16384,"cell_head_chars":4096},"cells_cut":0,"cells_raw":0,"read":"whole","date_system":"1900"}

{"sheet":"NBR Frontpage","index":0,"n_rows":48,"n_cols":30,"rows_kept":48,"cut":false,"hidden":false,"merged":[[16,0,17,1],[19,0,19,1],[20,0,21,1]]}
[]
[null,null,null,null,null,null,null,null,null,null,null,null,null,null,null,null,null,null,null,null,null,null,null,null,null,null,null,null,null,"518-2009"]
[]
[null,"536/2019"]
[null,"Report"]
[]
[]
[]
[]
[]
[]
[]
[]
[]
[]
[]
["Program för ogräsbekämpning"]
[]
[]
["Aim"]
["Future weed strategies in sugar beets in sweden"]
[]
[]
[]
[]
["Rapport med försöksdata och resultattabeller"]
["Report with trial data and tables of result"]
[]
[]
[]
[]
["Denna publikation innehåller försöksdata och resultat i tabeller och figurer. Det kan förekomma"]
["mindre fel och inkonsekvenser i språk och layout. Alla sidor är inte alltid utskriftsvänliga."]
["Vid frågor eller kommentarer är du alltid välkommen att kontakta författaren nedan."]
[]
["The appendix comprises documentations from the research project. Minor mistakes in language "]
["and lack of adjustments in layout may occur. Questions may be addressed to the project manager."]
[]
[]
[]
[{"$f":"VLOOKUP([11]Input!C7,[11]Listor!$A$21:$J$31,2,FALSE)","v":"Joakim Ekelöf"}]
[{"$f":"VLOOKUP([11]Input!C7,[11]Listor!$A$21:$J$31,5,FALSE)","v":"JE@nbrf.nu"}]
[{"$f":"VLOOKUP([11]Input!C7,[11]Listor!$A$21:$J$31,3,FALSE)","v":"(+46) 736 28 67 24"}]
[]
["NBR Nordic Beet Research Foundation (Fond)"]
["DK: Højbygårdvej 14, DK-4960 Holeby"]
["SE: Borgeby Slottsväg 11, SE-237 91 Bjärred"]
["Phone: +45 54 60 14 40","http://www.nordicbeet.nu/"]

{"sheet":"Information","index":1,"n_rows":0,"n_cols":0,"rows_kept":0,"cut":false,"hidden":false,"merged":[]}

{"sheet":"Plan","index":2,"n_rows":23,"n_cols":24,"rows_kept":23,"cut":false,"hidden":false,"merged":[]}
["536 Program för ogräsbekämpning"]
["temp2"]
["Formål/Aim:"]
["Framtidens ogräsbekämpning i sockerbetor i Sverige"]
["Future weed strategies in sugar beets in sweden"]
[]
["Entry","Ref","Strategi","Variety"]
[1,null,"Obehandlat","Daphna "]
[2,"R",{"$f":"VLOOKUP(A9,'[20]Sprut plan Borg + Laxm'!$A$10:$S$128,19,FALSE)","v":"Conviso smart"},"Renja KWS"]
[3,null,{"$f":"VLOOKUP(A10,'[20]Sprut plan Borg + Laxm'!$A$10:$S$128,19,FALSE)","v":"Conviso smart förstärkt med Tanaris"},"Renja KWS"]
[4,null,{"$f":"VLOOKUP(A11,'[20]Sprut plan Borg + Laxm'!$A$10:$S$128,19,FALSE)","v":"Betanal Power"},"Daphna "]
[5,null,{"$f":"VLOOKUP(A12,'[20]Sprut plan Borg + Laxm'!$A$10:$S$128,19,FALSE)","v":"Utan Desmedifam"},"Daphna "]
[6,null,{"$f":"VLOOKUP(A13,'[20]Sprut plan Borg + Laxm'!$A$10:$S$128,19,FALSE)","v":"Utan Desmedifam och Fenmedifam"},"Daphna "]
[7,null,{"$f":"VLOOKUP(A14,'[20]Sprut plan Borg + Laxm'!$A$10:$S$128,19,FALSE)","v":"Utan Desmedifam stärkt med Centium"},"Daphna "]
[8,null,{"$f":"VLOOKUP(A15,'[20]Sprut plan Borg + Laxm'!$A$10:$S$128,19,FALSE)","v":"Hög dos Fenmedifam"},"Daphna "]
[9,null,{"$f":"VLOOKUP(A16,'[20]Sprut plan Borg + Laxm'!$A$10:$S$128,19,FALSE)","v":"Utan Desmedifam + Fenmedifam stärkt med allt"},"Daphna "]
[10,null,{"$f":"VLOOKUP(A17,'[20]Sprut plan Borg + Laxm'!$A$10:$S$128,19,FALSE)","v":"Tanaris"},"Daphna "]
[11,null,{"$f":"VLOOKUP(A18,'[20]Sprut plan Borg + Laxm'!$A$10:$S$128,19,FALSE)","v":"Goltix Queen (jämförs mot led 6)"},"Daphna "]
[12,null,{"$f":"VLOOKUP(A19,'[20]Sprut plan Borg + Laxm'!$A$10:$S$128,19,FALSE)","v":"pH-Opti"},"Daphna "]
[13,null,{"$f":"VLOOKUP(A20,'[20]Sprut plan Borg + Laxm'!$A$10:$S$128,19,FALSE)","v":"Centium innan uppkomst"},"Daphna "]
[14,null,{"$f":"VLOOKUP(A21,'[20]Sprut plan Borg + Laxm'!$A$10:$S$128,19,FALSE)","v":"Safari Duo"},"Daphna "]
[]
[null,null,null,null,null,null,null,null,null,null,null,null,null,null,null,null,null,null,null,null,null,null,null,"Joakim Ekelöf"]

{"sheet":"Listor","index":3,"n_rows":14,"n_cols":1,"rows_kept":14,"cut":false,"hidden":true,"merged":[]}
["Sortering av flikarna"]
[]
[]
[]
[]
["Treatments"]
["Soil samples"]
["Plan"]
["Information"]
["NBR Frontpage"]
["db"]
[]
[]
["Slutet"]

{"sheet":"Random Plan","index":4,"n_rows":69,"n_cols":20,"rows_kept":69,"cut":false,"hidden":true,"merged":[]}
["536 Program för ogräsbekämpning",null,null,null,null,null,null,null,null,null,null,null,null,null,null,null,null,null,null,"Conviso One"]
[null,null,null,null,null,null,null,null,null,null,null,null,null,null,null,null,null,null,null,"Daphna"]
[null,null,null,null,null,null,null,null,null,null,null,null,null,null,null,null,null,null,null,"Johanna"]
[]
[]
[]
[]
[]
[]
[]
[]
[]
[]
[]
[]
[]
[null,"101 Borgeby, Leif Bengtsson, tel: 073 8"]
["Block4",14,5,7,6,3,19,8,12,2,9,13,11,1,4]
[null,43,44,45,46,47,48,49,50,51,52,53,54,55,56]
["Block3",13,7,4,2,11,10,1,5,12,3,9,8,6,14]
[null,29,30,31,32,33,34,35,36,37,38,39,40,41,42]
["Block2",1,6,7,3,4,9,8,14,10,2,11,12,5,13]
[null,15,16,17,18,19,20,21,22,23,24,25,26,27,28]
["Block1",10,8,3,5,11,1,12,6,13,14,2,4,7,9]
[null,1,2,3,4,5,6,7,8,9,10,11,12,13,14]
[]
[]
[null,"102 St Uppåkra, Lars-Åke Bengtsson, tel"]
["Block4",11,2,7,8,10,1,13,5,6,9,4,14,3,12]
[null,43,44,45,46,47,48,49,50,51,52,53,54,55,56]
["Block3",4,1,3,6,8,11,5,9,13,7,14,2,12,10]
[null,29,30,31,32,33,34,35,36,37,38,39,40,41,42]
["Block2",6,5,2,12,11,9,14,4,10,13,7,3,8,1]
[null,15,16,17,18,19,20,21,22,23,24,25,26,27,28]
["Block1",10,3,1,11,8,4,7,6,13,9,2,14,12,5]
[null,1,2,3,4,5,6,7,8,9,10,11,12,13,14]
[]
[]
[null,"103 xx, xx, tel: xx (0)"]
["Block4",1,7,14,12,4,3,9,6,13,10,8,11,2,5]
[null,43,44,45,46,47,48,49,50,51,52,53,54,55,56]
["Block3",14,12,9,10,2,11,7,1,6,5,4,8,13,3]
[null,29,30,31,32,33,34,35,36,37,38,39,40,41,42]
["Block2",13,4,14,8,3,7,10,9,12,6,1,5,11,2]
[null,15,16,17,18,19,20,21,22,23,24,25,26,27,28]
["Block1",5,12,4,2,7,9,1,11,14,8,13,10,3,6]
[null,1,2,3,4,5,6,7,8,9,10,11,12,13,14]
[]
[]
[null,"104 Ej utlagt, AA Not decided yet, tel:"]
["Block4",10,9,8,12,3,14,11,5,6,7,4,13,2,1]
[null,43,44,45,46,47,48,49,50,51,52,53,54,55,56]
["Block3",6,5,1,3,7,8,4,14,12,13,11,2,9,10]
[null,29,30,31,32,33,34,35,36,37,38,39,40,41,42]
["Block2",9,1,12,3,5,7,6,13,4,11,10,2,8,14]
[null,15,16,17,18,19,20,21,22,23,24,25,26,27,28]
["Block1",7,13,2,14,8,11,5,6,9,12,1,4,3,10]
[null,1,2,3,4,5,6,7,8,9,10,11,12,13,14]
[]
[]
[null,"105 Ej utlagt, AA Not decided yet, tel:"]
["Block4",11,2,4,7,6,9,12,14,8,3,1,10,13,5]
[null,43,44,45,46,47,48,49,50,51,52,53,54,55,56]
["Block3",3,9,1,14,13,12,6,7,2,10,5,8,4,11]
[null,29,30,31,32,33,34,35,36,37,38,39,40,41,42]
["Block2",2,14,9,11,6,8,12,10,3,1,13,4,7,5]
[null,15,16,17,18,19,20,21,22,23,24,25,26,27,28]
["Block1",14,3,10,6,7,11,13,2,4,1,5,9,8,12]
[null,1,2,3,4,5,6,7,8,9,10,11,12,13,14]

{"sheet":"db","index":5,"n_rows":811,"n_cols":19,"rows_kept":811,"cut":false,"hidden":true,"merged":[]}
["Order","Sascode","Swedish","Danish","English","Expl","Unit","Decimals  and formatting values","Decimals  and formatting heading","Column width","Posetive with high value =1","trans-formation","treatment","errpr_distr","missing_value","multiple_testing_adjustment",null,"Språkkod:",3]
[5,"pi","Nematoder","Nematode","Pi","Beet cyst","eal/g",1,1,12,0,"identity","treatm","normal"]
[6,"pf","Nematoder","Nematode","Pf","Beet cyst","eal/g",1,1,12,0,"identity","treatm","normal"]
[7,"pfpi","Nematoder","Nematode","Pf/Pi","Beet cyst","eal/g",1,1,12,0,"identity","treatm","normal",null,null,null,"Svenska",3]
[8,"plh50","Plant nr","Planter","Plant no",0.5,"1000/ha",1,1,8,1,"identity","treatm","normal",null,null,null,"Danska",4]
[9,"plh100","Plant nr","Planter","Plant no",1,"1000/ha",1,1,8,1,"identity","treatm","normal",0,null,null,"Engelska",5]
[10,"plhfin","Plant nr","Planter","Plant no","Final ","1000/ha",1,1,8,1,"identity","treatm","normal",0]
[11,"pln_parc","Plant nr","Planter","Plant no",1,"nr/plot",1,1,8,1,"identity","treatm","normal",0]
[12,"topweight_kg","Rotvikt","Rod","Root weight","june","kg/20 beets",1,1,10,1,"identity","treatm","normal",0]
[13,"rootweight_kg","Blastvikt","foliage","Leaf weight","june","kg/20 beets",1,1,10,1,"identity","treatm","normal",0]
[14,"totalwgt_kg","Total  vikt","Total  vikt","Total  weight","june","kg/20 beets",1,1,10,1,"identity","treatm","normal",0]
[15,"weirot","Rot","Rod","Root ",null,"t/ha",1,1,5,1,"identity","treatm","normal",0]
[16,"pol","Socker","Sukker","Sugar",null,"%",1,1,7,1,"identity","treatm","normal",0]
[17,"sug","Socker","Sukker","Sugar",null,"t/ha",1,1,7,1,"identity","treatm","normal",0]
[18,"sugrel","Socker","Sukker","Sugar",null,"relative",1,1,7,1,"identity","treatm","normal",0]
[19,"sugrel2","Socker","Sukker","Sugar",null,"relative",1,1,7,1,"identity","treatm","normal",0]
[20,"econse","Ekonomi ","Økonomi","Economy","Total income","SEK/ha",1,1,12,1,"identity","treatm","normal"]
[21,"diffeconavgse","Ekonomi ","Økonomi","Economy","Diff to avg.","SEK/ha",1,1,12,1,"identity","treatm","normal"]
[22,"diffecon_nt_se","Ekonomi","Økonomi","Economy","Diff to NT","SEK/ha",1,1,12,1,"identity","treatm","normal"]
[23,"econ2se","Ekonomi ","Økonomi","Economy","Total income","SEK/ha",1,1,12,1,"identity","treatm","normal"]
[24,"diffecon_sus_se","Ekonomi","Økonomi","Economy","Diff to suceptible","SEK/ha",1,1,12,1,"identity","treatm","normal"]
[25,"econdk","Ekonomi","Forenklet","Økonomi","Total income","DKK/ha",1,1,12,1,"identity","treatm","normal"]
[26,"diffeconavgdk","Ekonomi","Forenklet","Økonomi","Diff to avg.","DKK/ha",1,1,12,1,"identity","treatm","normal"]
[27,"diffecon_nt_dk","Ekonomi","Forenklet","Økonomi","Diff to NT","DKK/ha",1,1,12,1,"identity","treatm","normal"]
[28,"econ2dk","Ekonomi","Forenklet","Økonomi","Total income","DKK/ha",1,1,12,1,"identity","treatm","normal"]
[29,"diffecon_sus_dk","Ekonomi","Forenklet","Økonomi","Diff to suceptible","DKK/ha",1,1,12,1,"identity","treatm","normal"]
[30,"dirt","Jord","Vh. jord","Tare",null,"%",1,1,7,0,"identity","treatm","normal"]
[31,"renpct","Renhet","Renhed","Cleaness",null,"%",1,1,7.5,1,"identity","treatm","normal",0]
[32,"rodfure","Rotfåra","Rodfure","Groove",null,"Sc. 1-9",1,1,8,1,"identity","treatm","normal",0]
[33,"kalium","K","K","K","pr 100 g sukker","mmol",1,1,7.5,0,"identity","treatm","normal",0]
[34,"natrium","Na","Na","Na","pr 100 g sukker","mmol",1,1,7.5,0,"identity","treatm","normal",0]
[35,"kna","K+Na","K+Na","K+Na","pr 100g beet","mmol",1,1,7.5,0,"identity","treatm","normal",0]
[36,"blaa","Blåtal","Amino-N","Amino-N","pr 100g beet","mg ",1,1,8,0,"identity","treatm","normal",0]
[37,"ivtal","IV-tal","IV-tal","IV-tal","pr 100 g sukker","mmol",1,1,8,0,"identity","treatm","normal"]
[38,"aph_scale5","Aphanomyces",null,"Aphanomyces","At factory","Sc. 0-5",1,1,14,0,"identity","treatm","normal"]
[39,"aph_vxt","Aphanomyces",null,"Aphanomyces","Greenhouse\n","Index 0-100",1,1,14,0,"identity","treatm","normal"]
[40,"aph_field","Aphanomyces",null,"Aphanomyces","Graded in field","Sc. 0-5",1,1,14,0,"identity","treatm","normal"]
[41,"mainbolt","Fröstockar","Stok","Bolters","Early","‰",1,1,8,0,"identity","treatm","normal"]
[42,"sidebolt","Sidoskott","Stok ","Lateral","Early","‰",1,1,8,0,"identity","treatm","normal"]
[43,"mainbolt_a2","Fröstockar","Stok ","Bolters","Late","‰",1,1,11,0,"identity","treatm","normal"]
[44,"sidebolt_a2","Sidoskott","Stok ","Lateral","Late","‰",1,1,8,0,"identity","treatm","normal"]
[45,"bolters","Fröstockar","stock","Bolters","Sum","‰",1,1,11,0,"identity","treatm","normal"]
[46,"height","Nackhöjd","Højde","Height",null,"mm",1,1,10,1,"identity","treatm","normal",0]
[47,"hojde_s15","Nackhöjd sd","Højde std","Height std",null,"mm",1,1,11,1,"identity","treatm","normal",0]
[48,"yellowleaf","Gula blad","Gule blade","Yellow leaves","Aug","Sc. 0-10",1,1,10.5,0,"identity","treatm","normal"]
[49,"leafcover","Bladtäckning","Bladdække","Leafcover","Sep","Sc. 1-100",1,1,13,1,"identity","treatm","normal"]
[50,"topvigour","Friskhet","Topfriskhed","Leaf vigour","Sep","Sc. 1-10",1,1,12,1,"identity","treatm","normal"]
[51,"mgdef","mgdef","Mg mangel","Mg deficiency",null,"Sc. 0-10",1,1,9,1,"identity","treatm","normal"]
[52,"vaskbarhed","Tvättbarhet","Vaskbar","Washability",null,"Sc. 1-9",1,1,8,1,"identity","treatm","normal"]
[53,"grenethed","Grenighet","Grene","Branching",null,"Sc. 1-9",1,1,8,1,"identity","treatm","normal"]
[54,"glathed","Ytans jämnhet","Glathed","Smoothness",null,"Sc. 1-4",1,1,11,1,"identity","treatm","normal"]
[55,"mildew_scale","Mjöldagg","Meldug","Mildew","Early","Sc. 1-100",1,1,9,0,"identity","treatm","normal"]
[56,"rust_scale","Rost","Rust","Rust","Early","Sc. 1-100",1,1,7,0,"identity","treatm","normal"]
[57,"ramularia_scale","Ramularia","Ramularia","Ramularia","Early","Sc. 1-100",1,1,10,0,"identity","treatm","normal"]
[58,"cerco_scale","Cercospora","Cercospora","Cercospora","Early","Sc. 1-100",1,1,11,0,"identity","treatm","normal"]
[59,"mildew_scale_a2","Mjöldagg","Meldug","Mildew","Mid","Sc. 1-100",1,1,9,0,"identity","treatm","normal"]
[60,"rust_scale_a2","Rost","Rust","Rust","Mid","Sc. 1-100",1,1,7,0,"identity","treatm","normal"]
[61,"ramularia_scale_a2","Ramularia","Ramularia","Ramularia","Mid","Sc. 1-100",1,1,10,0,"identity","treatm","normal"]
[62,"cerco_scale_a2","Cercospora","Cercospora","Cercospora","Mid","Sc. 1-100",1,1,11,0,"identity","treatm","normal"]
[63,"mildew_scale_a3","Mjöldagg","Meldug","Mildew","Late","Sc. 1-100",1,1,9,0,"identity","treatm","normal"]
[64,"rust_scale_a3","Rost","Rust","Rust","Late","Sc. 1-100",1,1,7,0,"identity","treatm","normal"]
[65,"ramularia_scale_a3","Ramularia","Ramularia","Ramularia","Late","Sc. 1-100",1,1,10,0,"identity","treatm","normal"]
[66,"cerco_scale_a3","Cercospora","Cercospora","Cercospora","Late","Sc. 1-100",1,1,11,0,"identity","treatm","normal"]
[67,"mildew_scale_a4","Mjöldagg","Meldug","Mildew","Very late","Sc. 1-100",1,1,9,0,"identity","treatm","normal"]
[68,"rust_scale_a4","Rost","Rust","Rust","Very late","Sc. 1-100",1,1,7,0,"identity","treatm","normal"]
[69,"ramularia_scale_a4","Ramularia","Ramularia","Ramularia","Very late","Sc. 1-100",1,1,10,0,"identity","treatm","normal"]
[70,"cerco_scale_a4","Cercospora","Cercospora","Cercospora","Very late","Sc. 1-100",1,1,11,0,"identity","treatm","normal"]
[71,"seedqual","Luckor",null,"Nr of gaps","per plot",">50 cm",1,1,12,0,"identity","treatm","normal"]
[72,"Svampresistens","Svampresistens",null,"untreated/treated","Leaf diseases","%",1,null,14,1,"identity","treatm","normal"]
[73,"frekvens_1","Frekvens","Frekvens","Frequency","nr1","100 blade %",1,1,11,0,"identity","treatm","normal"]
[74,"frekvens_2","Frekvens","Frekvens","Frequency","nr2","100 blade %",1,1,11,0,"identity","treatm","normal"]
[75,"frekvens_3","Frekvens","Frekvens","Frequency","nr3","100 blade %",1,1,11,0,"identity","treatm","normal"]
[76,"frekvens_4","Frekvens","Frekvens","Frequency","nr4","100 blade %",1,1,11,0,"identity","treatm","normal"]
[77,"frekvens_5","Frekvens","Frekvens","Frequency","nr5","100 blade %",1,1,11,0,"identity","treatm","normal"]
[78,"frekvens_6","Frekvens","Frekvens","Frequency","nr6","100 blade %",1,1,11,0,"identity","treatm","normal"]
[79,"frekvens_7","Frekvens","Frekvens","Frequency","nr7","100 blade %",1,1,11,0,"identity","treatm","normal"]
[80,"frekvens_8","Frekvens","Frekvens","Frequency","nr8","100 blade %",1,1,11,0,"identity","treatm","normal"]
[81,"regrowth","Återväxt",null,"Regrowth","Late","Sc. 1-100",1,1,11.5,0,"identity","treatm","normal"]
[82,"N","Kväve",null,"Nitrogen",2.7,"(%)",1,1,7,1,"identity","treatm","normal",0,null,{"$f":"_xludf.split(B79,2)","v":{"$error":"#NAME?"}}]
[83,"P","Fosfor",null,"Phosphorus",0.27,"(%)",1,1,7,1,"identity","treatm","normal",0]
[84,"K","Kalium",null,"Potassium",2.7,"(%)",1,1,7,1,"identity","treatm","normal",0]
[85,"Mn","Mangan",null,"Manganese",35,"(ppm)",1,1,8,1,"identity","treatm","normal",0]
[86,"B","Bor",null,"Boron",35,"(ppm)",1,1,5,1,"identity","treatm","normal",0]
[87,"Na","Natrium",null,"Sodium",null,"(%)",1,1,8,1,"identity","treatm","normal",0]
[88,"Mg","Magnesium",null,"Magnesium",0.23,"(%)",1,1,11,1,"identity","treatm","normal",0]
[89,"Ca","Kalcium",null,"Calcium",0.53,"(%)",1,1,8,1,"identity","treatm","normal",0]
[90,"Cu","Koppar",null,"Copper",5.4,"(ppm)",1,1,7,1,"identity","treatm","normal",0]
[91,"Mo","Molybden",null,"Molybdenum",0.19,"(ppm)",1,1,10,1,"identity","treatm","normal",0]
[92,"Fe","Järn",null,"Iron",38,"(ppm)",1,1,5,1,"identity","treatm","normal",0]
[93,"Zn","Zink",null,"Zinc",50,"(ppm)",1,1,6,1,"identity","treatm","normal",0]
[94,"S","Svavel",null,"Sulphur",0.2,"(%)",1,1,7,1,"identity","treatm","normal",0]
[95,"DW","Torrvikt",null,"Dry weight","Early","(g)",1,1,10,1,"identity","treatm","normal",0]
[96,"N_a2","Kväve",null,"Nitrogen","Late","(%)",1,1,10,1,"identity","treatm","normal",0]
[97,"P_a2","Fosfor",null,"Phosphorus","Late","(%)",1,1,10,1,"identity","treatm","normal",0]
[98,"K_a2","Kalium",null,"Potassium","Late","(%)",1,1,10,1,"identity","treatm","normal",0]
[99,"Mn_a2","Mangan",null,"Manganese","Late","(ppm)",1,1,10,1,"identity","treatm","normal",0]
[100,"B_a2","Bor",null,"Boron","Late","(ppm)",1,1,10,1,"identity","treatm","normal",0]
[101,"Na_a2","Natrium",null,"Sodium","Late","(%)",1,1,10,1,"identity","treatm","normal",0]
[102,"Mg_a2","Magnesium",null,"Magnesium","Late","(%)",1,1,10,1,"identity","treatm","normal",0]
[103,"Ca_a2","Kalcium",null,"Calcium","Late","(%)",1,1,10,1,"identity","treatm","normal",0]
[104,"Cu_a2","Koppar",null,"Copper","Late","(ppm)",1,1,10,1,"identity","treatm","normal",0]
[105,"Mo_a2","Molybden",null,"Molybdenum","Late","(ppm)",1,1,10,1,"identity","treatm","normal",0]
[106,"Fe_a2","Järn",null,"Iron","Late","(ppm)",1,1,10,1,"identity","treatm","normal",0]
[107,"Zn_a2","Zink",null,"Zinc","Late","(ppm)",1,1,10,1,"identity","treatm","normal",0]
[108,"S_a2","Svavel",null,"Sulphur","Late","(%)",1,1,10,1,"identity","treatm","normal",0]
[109,"DW_a2","Torrvikt",null,"Dry weight","Late","(g)",1,1,10,1,"identity","treatm","normal"]
[110,"br_weight_in1","Vikt ",null,"Weight","Before storage","(kg)",1,1,10,1,"identity","treatm","normal"]
[111,"sh_in","Sockerhalt",null,"sugar content","Before storage","(%)",1,1,10,1,"identity","treatm","normal"]
[112,"renpct_in","Renhet",null,"Cleaness","Before storage","(%)",1,1,10,1,"identity","treatm","normal"]
[113,"sy_in","Sockermängd",null,"Sugar","per box (BS)","(kg)",1,1,10,1,"identity","treatm","normal"]
[114,"inv_in","Invert",null,"Invert","Before storage","(mmol/kg beet)",1,1,10,1,"identity","treatm","normal"]
[115,"ts_in","Torrsubstans",null,"Dry matter","Before storage","(%)",1,1,10,1,"identity","treatm","normal"]
[116,"br_weight_out1","Vikt ",null,"Weight","After storage","(kg)",1,1,10,1,"identity","treatm","normal"]
[117,"sh_out","Sockerhalt",null,"sugar content","After storage","(%)",1,1,10,1,"identity","treatm","normal"]
[118,"sy_out","Sockermängd",null,"Sugar","per box (AS)","(kg)",1,1,10,1,"identity","treatm","normal"]
[119,"inv_out","Invert",null,"Invert","After storage","(mmol/kg beet)",1,1,10,1,"identity","treatm","normal"]
[120,"ts_out","Torrsubstans",null,"Dry matter","After storage","(%)",1,1,10,1,"identity","treatm","normal"]
[121,"blaa_out","Blåtal",null,"Amino-N","After storage","mg/100g sugar",1,1,10,1,"identity","treatm","normal"]
[122,"kan_out","K+Na",null,"K+Na","After storage",null,1,1,10,1,"identity","treatm","normal"]
[123,"S_loss1","Sockerförlust",null,"Sugar loss","After storage","(%)",1,1,10,1,"identity","treatm","normal"]
[124,"S_loss2","Sockerförlust",null,"Sugar loss","After storage","(%)",1,1,10,1,"identity","treatm","normal"]
[125,"pen_avg","Penetrometer",null,"penetrometer","early","Mpa",1,1,14,1,"identity","treatm","normal",0]
[126,"pen_avg_a2","Penetrometer",null,"penetrometer","late","Mpa",1,1,14,1,"identity","treatm","normal",0]
[127,"NDVI","NDVI","NDVI","NDVI","Measurement 1","Ground cover",1,1,10,1,"identity","treatm","normal",0]
[128,"NDVI_a2","NDVI","NDVI","NDVI","Measurement 2","Ground cover",1,1,10,1,"identity","treatm","normal",0]
[129,"NDVI_a3","NDVI","NDVI","NDVI","Measurement 3","Ground cover",1,1,10,1,"identity","treatm","normal",0]
[130,"NDVI_a4","NDVI","NDVI","NDVI","Measurement 4","Ground cover",1,1,10,1,"identity","treatm","normal",0]
[131,"NDVI_a5","NDVI","NDVI","NDVI","Measurement 5","Ground cover",1,1,10,1,"identity","treatm","normal",0]
[132,"Cardy_N","N Konc","N Konc","quick sensor","Measurement 1"," ppm No3",1,1,10,1,"identity","treatm","normal",0]
[133,"Cardy_Na","Na Konc","Na Konc","quick sensor","Measurement 1"," ppm Na3",1,1,10,1,"identity","treatm","normal",0]
[134,"Cardy_K","K Konc","K Konc","quick sensor","Measurement 1"," ppm K",1,1,10,1,"identity","treatm","normal",0]
[135,"Cardy_N_a2","N Konc","N Konc","quick sensor","Measurement 2"," ppm No3",1,1,10,1,"identity","treatm","normal",0]
[136,"Cardy_Na_a2","Na Konc","Na Konc","quick sensor","Measurement 2"," ppm Na3",1,1,10,1,"identity","treatm","normal",0]
[137,"Cardy_K_a2","K Konc","K Konc","quick sensor","Measurement 2"," ppm K",1,1,10,1,"identity","treatm","normal",0]
[138,"Cardy_N_a3","N Konc","N Konc","quick sensor","Measurement 3"," ppm No3",1,1,10,1,"identity","treatm","normal",0]
[139,"Cardy_Na_a3","Na Konc","Na Konc","quick sensor","Measurement 3"," ppm Na3",1,1,10,1,"identity","treatm","normal",0]
[140,"Cardy_K_a3","K Konc","K Konc","quick sensor","Measurement 3"," ppm K",1,1,10,1,"identity","treatm","normal",0]
[141,"Cardy_N_a4","N Konc","N Konc","quick sensor","Measurement 4"," ppm No3",1,1,10,1,"identity","treatm","normal",0]
[142,"Cardy_Na_a4","Na Konc","Na Konc","quick sensor","Measurement 4"," ppm Na3",1,1,10,1,"identity","treatm","normal",0]
[143,"Cardy_K_a4","K Konc","K Konc","quick sensor","Measurement 4"," ppm K",1,1,10,1,"identity","treatm","normal",0]
[144,"br_weight_in1","Vikt ",null,"Weight","Before storage","(kg)",1,1,10,1,"identity","treatm","normal"]
[145,"sh_in","Sockerhalt",null,"sugar content","Before storage","(%)",1,1,10,1,"identity","treatm","normal"]
[146,"renpct_in","Renhet",null,"Cleaness","Before storage","(%)",1,1,10,1,"identity","treatm","normal"]
[147,"sy_in","Sockermängd",null,"Sugar","per box (BS)","(kg)",1,1,10,1,"identity","treatm","normal"]
[148,"inv_in","Invert",null,"Invert","Before storage","(mmol/kg beet)",1,1,10,1,"identity","treatm","normal"]
[149,"ts_in","Torrsubstans",null,"Dry matter","Before storage","(%)",1,1,10,1,"identity","treatm","normal"]
[150,"br_weight_out1","Vikt ",null,"Weight","After storage","(kg)",1,1,10,1,"identity","treatm","normal"]
[151,"sh_out","Sockerhalt",null,"sugar content","After storage","(%)",1,1,10,1,"identity","treatm","normal"]
[152,"sy_out","Sockermängd",null,"Sugar","per box (AS)","(kg)",1,1,10,1,"identity","treatm","normal"]
[153,"inv_out","Invert",null,"Invert","After storage","(mmol/kg beet)",1,1,10,1,"identity","treatm","normal"]
[154,"ts_out","Torrsubstans",null,"Dry matter","After storage","(%)",1,1,10,1,"identity","treatm","normal"]
[155,"blaa_out","Blåtal",null,"Amino-N","After storage","mg/100g sugar",1,1,10,1,"identity","treatm","normal"]
[156,"kan_out","K+Na",null,"K+Na","After storage",null,1,1,10,1,"identity","treatm","normal"]
[157,"S_loss1","Sockerförlust",null,"Sugar loss","After storage","(%)",1,1,10,1,"identity","treatm","normal"]
[158,"S_loss2","Sockerförlust",null,"Sugar loss","After storage","(%)",1,1,10,1,"identity","treatm","normal"]
[159,"Type",null,null,null,null,null,1,1,10,1,"identity","treatm","normal"]
[160,"gen_phy","Generell fytotox ","Generell procentuell fytotox ","gen_phy","First grading","1-30",1,1,15,1,"identity","treatm","normal"]
[161,"gen_phy_a2","Generell fytotox ","Generell procentuell fytotox ","gen_phy","Second grading","1-30",1,1,15,1,"identity","treatm","normal"]
[162,"gen_phy_a3","Generell fytotox ","Generell procentuell fytotox ","gen_phy","Third grading","1-30",1,1,15,1,"identity","treatm","normal"]
[163,"AAAAA_PROC_1","Marktäckning ogräs","Total marktäckning","Ground cover","Below, June","% ",1,1,18,1,"identity","treatm","normal"]
[164,"AAAAA_proc_obs1","Marktäckning ogräs","Total marktäckning","Ground cover","First grading","% ",1,1,18,1,"identity","treatm","normal"]
[165,"AAAAA_proc_obs1_a2","Marktäckning ogräs","Total marktäckning","Ground cover","Below, Aug","% ",1,1,18,1,"identity","treatm","normal"]
[166,"AAAAA_above_obs1","Marktäckning ogräs","Total marktäckning","Ground cover","Above foliage","% in Aug ",1,1,18,1,"identity","treatm","normal"]
[167,"AAAAA_2UB","Marktäckning ogräs","Total marktäckning","Ground cover","Below, Aug","% ",1,1,14,1,"identity","treatm","normal"]
[168,"AAAAA_2ÖB","Marktäckning ogräs","Total marktäckning","Ground cover","Above, Aug","% ",1,1,14,1,"identity","treatm","normal"]
[169,"thi_phy","Glesning","Glesning","thi_phy","First grading","%",1,1,8,1,"identity","treatm","normal"]
[170,"vor_phy","Biomassareduktion","Biomassareduktion","vor_phy","First grading","%",1,1,18,1,"identity","treatm","normal"]
[171,"stu_phy","Eftersatt höjdtillväxt ","Eftersatt höjdtillväxt ","stu_phy","First grading","%",1,1,18,1,"identity","treatm","normal"]
[172,"ble_phy","Vitfärgning","Vitfärgning","ble_phy","First grading","%",1,1,10,1,"identity","treatm","normal"]
[173,"chl_phy","Kloros","Kloros","chl_phy","First grading","%",1,1,8,1,"identity","treatm","normal"]
[174,"nec_phy","Nekros","Nekros","nec_phy","First grading","%",1,1,8,1,"identity","treatm","normal"]
[175,"def_phy","Missbildade blad ","Missbildade blad ","def_phy","First grading","%",1,1,15,1,"identity","treatm","normal"]
[176,"phy_ldr","Tappade blad ","Tappade blad ","phy_ldr","First grading","%",1,1,14,1,"identity","treatm","normal"]
[177,"phy_war","Försvagat vaxlager ","Försvagat vaxlager ","phy_war","First grading","%",1,1,16,1,"identity","treatm","normal"]
[178,"phy_del","Försenad tillväxt ","Försenad tillväxt ","phy_del","First grading","%",1,1,14,1,"identity","treatm","normal"]
[179,"thi_phy_a2","Glesning","Glesning","thi_phy","Second grading","%",1,1,8,1,"identity","treatm","normal"]
[180,"vor_phy_a2","Biomassareduktion","Biomassareduktion","vor_phy","Second grading","%",1,1,18,1,"identity","treatm","normal"]
[181,"stu_phy_a2","Eftersatt höjdtillväxt ","Eftersatt höjdtillväxt ","stu_phy","Second grading","%",1,1,18,1,"identity","treatm","normal"]
[182,"ble_phy_a2","Vitfärgning","Vitfärgning","ble_phy","Second grading","%",1,1,10,1,"identity","treatm","normal"]
[183,"chl_phy_a2","Kloros","Kloros","chl_phy","Second grading","%",1,1,8,1,"identity","treatm","normal"]
[184,"nec_phy_a2","Nekros","Nekros","nec_phy","Second grading","%",1,1,8,1,"identity","treatm","normal"]
[185,"def_phy_a2","Missbildade blad ","Missbildade blad ","def_phy","Second grading","%",1,1,15,1,"identity","treatm","normal"]
[186,"phy_ldr_a2","Tappade blad ","Tappade blad ","phy_ldr","Second grading","%",1,1,14,1,"identity","treatm","normal"]
[187,"phy_war_a2","Försvagat vaxlager ","Försvagat vaxlager ","phy_war","Second grading","%",1,1,16,1,"identity","treatm","normal"]
[188,"phy_del_a2","Försenad tillväxt ","Försenad tillväxt ","phy_del","Second grading","%",1,1,16,1,"identity","treatm","normal"]
[189,"thi_phy_a3","Glesning","Glesning","thi_phy","Third grading","%",1,1,8,1,"identity","treatm","normal"]
[190,"vor_phy_a3","Biomassareduktion","Biomassareduktion","vor_phy","Third grading","%",1,1,18,1,"identity","treatm","normal"]
[191,"stu_phy_a3","Eftersatt höjdtillväxt ","Eftersatt höjdtillväxt ","stu_phy","Third grading","%",1,1,18,1,"identity","treatm","normal"]
[192,"ble_phy_a3","Vitfärgning","Vitfärgning","ble_phy","Third grading","%",1,1,10,1,"identity","treatm","normal"]
[193,"chl_phy_a3","Kloros","Kloros","chl_phy","Third grading","%",1,1,8,1,"identity","treatm","normal"]
[194,"nec_phy_a3","Nekros","Nekros","nec_phy","Third grading","%",1,1,8,1,"identity","treatm","normal"]
[195,"def_phy_a3","Missbildade blad ","Missbildade blad ","def_phy","Third grading","%",1,1,15,1,"identity","treatm","normal"]
[196,"phy_ldr_a3","Tappade blad ","Tappade blad ","phy_ldr","Third grading","%",1,1,14,1,"identity","treatm","normal"]
[197,"phy_war_a3","Försvagat vaxlager ","Försvagat vaxlager ","phy_war","Third grading","%",1,1,16,1,"identity","treatm","normal"]
[198,"phy_del_a3","Försenad tillväxt ","Försenad tillväxt ","phy_del","Third grading","%",1,1,16,1,"identity","treatm","normal"]
[199,"fytotox_chl_1","Kloros",null,"fytotox clorosis","TII+10d","% ",1,1,14,1,"identity","treatm","normal"]
[200,"fytotox_chl_2","Kloros",null,"fytotox clorosis","TIV+10d","% ",1,1,14,1,"identity","treatm","normal"]
[201,"fytotox_red_1","Tillväxthämning",null,"Growth reduction","TII+10d","% ",1,1,14,1,"identity","treatm","normal"]
[202,"fytotox_red_2","Tillväxthämning",null,"Growth reduction","TIV+10d","% ",1,1,14,1,"identity","treatm","normal"]
[203,"fytotox_def_1","Deformerade blad",null,"fytotox deformation","TII+10d","% ",1,1,14,1,"identity","treatm","normal"]
[204,"fytotox_def_2","Deformerade blad",null,"fytotox deformation","TIV+10d","% ",1,1,14,1,"identity","treatm","normal"]
[205,"AEOPO_proc_obs1","Kirskål","Skvalderkål","AEOPO","First grading","% ",1,1,14,1,"identity","treatm","normal"]
[206,"AETCY_proc_obs1","Vildpersilja","Hundepersille","AETCY","First grading","% ",1,1,14,1,"identity","treatm","normal"]
[207,"AGRRE_proc_obs1","Kvickrot","Almindelig Kvik","AGRRE","First grading","% ",1,1,14,1,"identity","treatm","normal"]
[208,"ALOMY_proc_obs1","Renkavle","Ager-Rævehale","ALOMY","First grading","% ",1,1,14,1,"identity","treatm","normal"]
[209,"ANCAR_proc_obs1","Fårtunga","Krumhals","ANCAR","First grading","% ",1,1,14,1,"identity","treatm","normal"]
[210,"ANGAR_proc_obs1","Rödmire","Arve rød","ANGAR","First grading","% ",1,1,14,1,"identity","treatm","normal"]
[211,"APESV_proc_obs1","Åkerven","Vindaks","APESV","First grading","% ",1,1,14,1,"identity","treatm","normal"]
[212,"ATXPA_proc_obs1","Vägmålla","Svinemaelde","ATXPA","First grading","% ",1,1,14,1,"identity","treatm","normal"]
[213,"AVEFA_proc_obs1","Flyghavre","Flyve-Havre","AVEFA","First grading","% ",1,1,14,1,"identity","treatm","normal"]
[214,"AVESA_proc_obs1","Spillhavre","Havre","AVESA","First grading","% ",1,1,14,1,"identity","treatm","normal"]
[215,"BBBAN_proc_obs1","Tvåhjbl Arter","Ukrudt tokimbladet","BBBAN","First grading","% ",1,1,14,1,"identity","treatm","normal"]
[216,"BRSNN_proc_obs1","Spillraps","Raps","BRSNN","First grading","% ",1,1,14,1,"identity","treatm","normal"]
[217,"CAPBP_proc_obs1","Lomme","Hyrdetaske","CAPBP","First grading","% ",1,1,14,1,"identity","treatm","normal"]
[218,"CENCY_proc_obs1","Blåklint","Kornblomst","CENCY","First grading","% ",1,1,14,1,"identity","treatm","normal"]
[219,"CHEAL_proc_obs1","Svinmålla","Gaasefod hvidmelet","CHEAL","First grading","% ",1,1,14,1,"identity","treatm","normal"]
[220,"CHESS_proc_obs1","Målla","Gåsefod-Arter","CHESS","First grading","% ",1,1,14,1,"identity","treatm","normal"]
[221,"CIRAR_proc_obs1","Åkertistel","Agertidsel","CIRAR","First grading","% ",1,1,14,1,"identity","treatm","normal"]
[222,"CONAR_proc_obs1","Åkervinda","Ager-Snerle","CONAR","First grading","% ",1,1,14,1,"identity","treatm","normal"]
[223,"CRDAR_proc_obs1","Sandtrav","Almindelig Sandkarse","CRDAR","First grading","% ",1,1,14,1,"identity","treatm","normal"]
[224,"ECHCG_proc_obs1","Hönshirs","Almindelig Hanespore","ECHCG","First grading","% ",1,1,14,1,"identity","treatm","normal"]
[225,"EPHEX_proc_obs1","Småtörel","Vortemaelk liden","EPHEX","First grading","% ",1,1,14,1,"identity","treatm","normal"]
[226,"EPHHE_proc_obs1","Revormstörel","Skaerm-Vortemaelk","EPHHE","First grading","% ",1,1,14,1,"identity","treatm","normal"]
[227,"EQUAR_proc_obs1","Åkerfräken","Ager-Padderok","EQUAR","First grading","% ",1,1,14,1,"identity","treatm","normal"]
[228,"EROCI_proc_obs1","Skatnäva","Hejrenaeb","EROCI","First grading","% ",1,1,14,1,"identity","treatm","normal"]
[229,"FUMOF_proc_obs1","Jordrök","Laege-Jordrøg","FUMOF","First grading","% ",1,1,14,1,"identity","treatm","normal"]
[230,"GAEBI_proc_obs1","Toppdån","Skov-Hanekro","GAEBI","First grading","% ",1,1,14,1,"identity","treatm","normal"]
[231,"GAELA_proc_obs1","Mjukdån","Sand-Hanekro","GAELA","First grading","% ",1,1,14,1,"identity","treatm","normal"]
[232,"GAESP_proc_obs1","Hampdån","Hamp-Hanekro","GAESP","First grading","% ",1,1,14,1,"identity","treatm","normal"]
[233,"GAESS_proc_obs1","Dån","Hanekro","GAESS","First grading","% ",1,1,14,1,"identity","treatm","normal"]
[234,"GAETE_proc_obs1","Pipdån","Almindelig Hanekro","GAETE","First grading","% ",1,1,14,1,"identity","treatm","normal"]
[235,"GALAP_proc_obs1","Snärjmåra","Burresnerre","GALAP","First grading","% ",1,1,14,1,"identity","treatm","normal"]
[236,"GERDI_proc_obs1","Fliknäva","Skov-Galtetand Stachys","GERDI","First grading","% ",1,1,14,1,"identity","treatm","normal"]
[237,"GERMO_proc_obs1","Mjuknäva","Kær-Galtetand Stachys","GERMO","First grading","% ",1,1,14,1,"identity","treatm","normal"]
[238,"GERPU_proc_obs1","Sparvnäva","Storkenaeb liden","GERPU","First grading","% ",1,1,14,1,"identity","treatm","normal"]
[239,"GERRO_proc_obs1","Stinknäva","Stinkende Storkenæb","GERRO","First grading","% ",1,1,14,1,"identity","treatm","normal"]
[240,"GERSS_proc_obs1","Näva","Storkenæb","GERSS","First grading","% ",1,1,14,1,"identity","treatm","normal"]
[241,"GGGAN_proc_obs1","Gräs, Annuell","Græs","GGGAN","First grading","% ",1,1,14,1,"identity","treatm","normal"]
[242,"HORVW_proc_obs1","Spillkorn","Korn spild","HORVW","First grading","% ",1,1,14,1,"identity","treatm","normal"]
[243,"LAMAL_proc_obs1","Vitplister","Døvnælde","LAMAL","First grading","% ",1,1,14,1,"identity","treatm","normal"]
[244,"LAMAM_proc_obs1","Mjukplister","Liden Torskemund","LAMAM","First grading","% ",1,1,14,1,"identity","treatm","normal"]
[245,"LAMIN_proc_obs1","Flikplister","Fliget Tvetand","LAMIN","First grading","% ",1,1,14,1,"identity","treatm","normal"]
[246,"LAMPU_proc_obs1","Rödplister","Tvetand roed","LAMPU","First grading","% ",1,1,14,1,"identity","treatm","normal"]
[247,"LAMSS_proc_obs1","Plister","Tvetand andre","LAMSS","First grading","% ",1,1,14,1,"identity","treatm","normal"]
[248,"LAPCO_proc_obs1","Harkål","Haremad","LAPCO","First grading","% ",1,1,14,1,"identity","treatm","normal"]
[249,"LOLMU_proc_obs1","Ital Rajgräs","Rajgræs, Italiensk","LOLMU","First grading","% ",1,1,14,1,"identity","treatm","normal"]
[250,"LOLPE_proc_obs1","Eng Rajgräs","Almindelig Rajgraes","LOLPE","First grading","% ",1,1,14,1,"identity","treatm","normal"]
[251,"MATCH_proc_obs1","Kamomill","Kamille vellugtende","MATCH","First grading","% ",1,1,14,1,"identity","treatm","normal"]
[252,"MATIN_proc_obs1","Baldersbrå","Kamille lugtloes","MATIN","First grading","% ",1,1,14,1,"identity","treatm","normal"]
[253,"MATSU_proc_obs1","Gatkamomill","Kamille skive","MATSU","First grading","% ",1,1,14,1,"identity","treatm","normal"]
[254,"MYOAR_proc_obs1","Åkerförgätmigej","Forglemmigej mark","MYOAR","First grading","% ",1,1,14,1,"identity","treatm","normal"]
[255,"MYOSS_proc_obs1","Förgätmigej","Forglemmigej","MYOSS","First grading","% ",1,1,14,1,"identity","treatm","normal"]
[256,"PAPRH_proc_obs1","Kornvallmo","Valmue Korn","PAPRH","First grading","% ",1,1,14,1,"identity","treatm","normal"]
[257,"PAPSS_proc_obs1","Vallmo","Valmue","PAPSS","First grading","% ",1,1,14,1,"identity","treatm","normal"]
[258,"PLALA_proc_obs1","Svartkämpar","Lancet-Vejbred","PLALA","First grading","% ",1,1,14,1,"identity","treatm","normal"]
[259,"PLAMA_proc_obs1","Groblad","Glat Vejbred","PLAMA","First grading","% ",1,1,14,1,"identity","treatm","normal"]
[260,"PLAME_proc_obs1","Rödkämpar","Dunet Vejbred","PLAME","First grading","% ",1,1,14,1,"identity","treatm","normal"]
[261,"POAAN_proc_obs1","Vitgröe","Rapgraes enaarig","POAAN","First grading","% ",1,1,14,1,"identity","treatm","normal"]
[262,"POLAM_proc_obs1","Vattenpilört","Vand-Pileurt","POLAM","First grading","% ",1,1,14,1,"identity","treatm","normal"]
[263,"POLAV_proc_obs1","Trampört","Pileurt vej","POLAV","First grading","% ",1,1,14,1,"identity","treatm","normal"]
[264,"POLCO_proc_obs1","Åkerbinda","Snerle-Pileurt","POLCO","First grading","% ",1,1,14,1,"identity","treatm","normal"]
[265,"POLCO_proc_obs1","åkerbinda","Pileurt snerle","POLCO","First grading","% ",1,1,14,1,"identity","treatm","normal"]
[266,"POLHY_proc_obs1","Bitterpilört","Bidende Pileurt","POLHY","First grading","% ",1,1,14,1,"identity","treatm","normal"]
[267,"POLLA_proc_obs1","Vanlig Pilört","Pileurt bleg","POLLA","First grading","% ",1,1,14,1,"identity","treatm","normal"]
[268,"POLPE_proc_obs1","Åkerpilört","Pileurt fersken","POLPE","First grading","% ",1,1,14,1,"identity","treatm","normal"]
[269,"RAPRA_proc_obs1","Åkerrättika","Kiddike","RAPRA","First grading","% ",1,1,14,1,"identity","treatm","normal"]
[270,"SENVU_proc_obs1","Korsört","Brandbaeger almindelig","SENVU","First grading","% ",1,1,14,1,"identity","treatm","normal"]
[271,"SILNO_proc_obs1","Nattglim","Limurt nat","SILNO","First grading","% ",1,1,14,1,"identity","treatm","normal"]
[272,"SINAR_proc_obs1","Åkersenap","Agersennep","SINAR","First grading","% ",1,1,14,1,"identity","treatm","normal"]
[273,"SOLNI_proc_obs1","Nattskatta","Natskygge sort","SOLNI","First grading","% ",1,1,14,1,"identity","treatm","normal"]
[274,"SOLTU_proc_obs1","Potatis","Kartoffel","SOLTU","First grading","% ",1,1,14,1,"identity","treatm","normal"]
[275,"SONAR_proc_obs1","Åkermolke","Svinemaelk ager","SONAR","First grading","% ",1,1,14,1,"identity","treatm","normal"]
[276,"SSYOF_proc_obs1","Vägsenap","Rød Tvetand","SSYOF","First grading","% ",1,1,14,1,"identity","treatm","normal"]
[277,"STAPA_proc_obs1","Knölsyska","Kær-Galtetand","STAPA","First grading","% ",1,1,14,1,"identity","treatm","normal"]
[278,"STEME_proc_obs1","Våtarv","Fuglegraes","STEME","First grading","% ",1,1,14,1,"identity","treatm","normal"]
[279,"TAROF_proc_obs1","Maskros","Almindelig Mælkebøtte","TAROF","First grading","% ",1,1,14,1,"identity","treatm","normal"]
[280,"THLAR_proc_obs1","Penningört","Almindelig Pengeurt","THLAR","First grading","% ",1,1,14,1,"identity","treatm","normal"]
[281,"TRZAW_proc_obs1","Spillvete","Hvede (spildkorn)","TRZAW","First grading","% ",1,1,14,1,"identity","treatm","normal"]
[282,"TTTTT_proc_obs1","Ogräs Ospec","Ukrudt uspecificeret","TTTTT","First grading","% ",1,1,14,1,"identity","treatm","normal"]
[283,"TUSFA_proc_obs1","Hästhov","Følfod","TUSFA","First grading","% ",1,1,14,1,"identity","treatm","normal"]
[284,"URTUR_proc_obs1","Etternässla","Liden Naelde","URTUR","First grading","% ",1,1,14,1,"identity","treatm","normal"]
[285,"VERAG_proc_obs1","Åkerveronika","Flerfarvet Ærenpris","VERAG","First grading","% ",1,1,14,1,"identity","treatm","normal"]
[286,"VERAR_proc_obs1","Fältveronika","Aerenpris mark","VERAR","First grading","% ",1,1,14,1,"identity","treatm","normal"]
[287,"VERHE_proc_obs1","Murgrönsveronika","Aerenspris vedbend","VERHE","First grading","% ",1,1,14,1,"identity","treatm","normal"]
[288,"VERPE_proc_obs1","Trädgårdsveronika","Aerenpris storkronet","VERPE","First grading","% ",1,1,14,1,"identity","treatm","normal"]
[289,"VERSS_proc_obs1","Veronika","Stedmoderblomst","VERSS","First grading","% ",1,1,14,1,"identity","treatm","normal"]
[290,"VIOAR_proc_obs1","Åkerviol","Ager-Stedmoderblomst","VIOAR","First grading","% ",1,1,14,1,"identity","treatm","normal"]
[291,"VIOSS_proc_obs1","Viol","Viol","VIOSS","First grading","% ",1,1,14,1,"identity","treatm","normal"]
[292,"AEOPO_proc_obs1_a2","Kirskål","Skvalderkål","AEOPO","Second grading","% ",1,1,14,1,"identity","treatm","normal"]
[293,"AETCY_proc_obs1_a2","Vildpersilja","Hundepersille","AETCY","Second grading","% ",1,1,14,1,"identity","treatm","normal"]
[294,"AGRRE_proc_obs1_a2","Kvickrot","Almindelig Kvik","AGRRE","Second grading","% ",1,1,14,1,"identity","treatm","normal"]
[295,"ALOMY_proc_obs1_a2","Renkavle","Ager-Rævehale","ALOMY","Second grading","% ",1,1,14,1,"identity","treatm","normal"]
[296,"ANCAR_proc_obs1_a2","Fårtunga","Krumhals","ANCAR","Second grading","% ",1,1,14,1,"identity","treatm","normal"]
[297,"ANGAR_proc_obs1_a2","Rödmire","Arve rød","ANGAR","Second grading","% ",1,1,14,1,"identity","treatm","normal"]
[298,"APESV_proc_obs1_a2","Åkerven","Vindaks","APESV","Second grading","% ",1,1,14,1,"identity","treatm","normal"]
[299,"ATXPA_proc_obs1_a2","Vägmålla","Svinemaelde","ATXPA","Second grading","% ",1,1,14,1,"identity","treatm","normal"]
[300,"AVEFA_proc_obs1_a2","Flyghavre","Flyve-Havre","AVEFA","Second grading","% ",1,1,14,1,"identity","treatm","normal"]
[301,"AVESA_proc_obs1_a2","Spillhavre","Havre","AVESA","Second grading","% ",1,1,14,1,"identity","treatm","normal"]
[302,"BBBAN_proc_obs1_a2","Tvåhjbl Arter","Ukrudt tokimbladet","BBBAN","Second grading","% ",1,1,14,1,"identity","treatm","normal"]
[303,"BRSNN_proc_obs1_a2","Spillraps","Raps","BRSNN","Second grading","% ",1,1,14,1,"identity","treatm","normal"]
[304,"CAPBP_proc_obs1_a2","Lomme","Hyrdetaske","CAPBP","Second grading","% ",1,1,14,1,"identity","treatm","normal"]
[305,"CENCY_proc_obs1_a2","Blåklint","Kornblomst","CENCY","Second grading","% ",1,1,14,1,"identity","treatm","normal"]
[306,"CHEAL_proc_obs1_a2","Svinmålla","Gaasefod hvidmelet","CHEAL","Second grading","% ",1,1,14,1,"identity","treatm","normal"]
[307,"CHESS_proc_obs1_a2","Målla","Gåsefod-Arter","CHESS","Second grading","% ",1,1,14,1,"identity","treatm","normal"]
[308,"CIRAR_proc_obs1_a2","Åkertistel","Agertidsel","CIRAR","Second grading","% ",1,1,14,1,"identity","treatm","normal"]
[309,"CONAR_proc_obs1_a2","Åkervinda","Ager-Snerle","CONAR","Second grading","% ",1,1,14,1,"identity","treatm","normal"]
[310,"CRDAR_proc_obs1_a2","Sandtrav","Almindelig Sandkarse","CRDAR","Second grading","% ",1,1,14,1,"identity","treatm","normal"]
[311,"ECHCG_proc_obs1_a2","Hönshirs","Almindelig Hanespore","ECHCG","Second grading","% ",1,1,14,1,"identity","treatm","normal"]
[312,"EPHEX_proc_obs1_a2","Småtörel","Vortemaelk liden","EPHEX","Second grading","% ",1,1,14,1,"identity","treatm","normal"]
[313,"EPHHE_proc_obs1_a2","Revormstörel","Skaerm-Vortemaelk","EPHHE","Second grading","% ",1,1,14,1,"identity","treatm","normal"]
[314,"EQUAR_proc_obs1_a2","Åkerfräken","Ager-Padderok","EQUAR","Second grading","% ",1,1,14,1,"identity","treatm","normal"]
[315,"EROCI_proc_obs1_a2","Skatnäva","Hejrenaeb","EROCI","Second grading","% ",1,1,14,1,"identity","treatm","normal"]
[316,"FUMOF_proc_obs1_a2","Jordrök","Laege-Jordrøg","FUMOF","Second grading","% ",1,1,14,1,"identity","treatm","normal"]
[317,"GAEBI_proc_obs1_a2","Toppdån","Skov-Hanekro","GAEBI","Second grading","% ",1,1,14,1,"identity","treatm","normal"]
[318,"GAELA_proc_obs1_a2","Mjukdån","Sand-Hanekro","GAELA","Second grading","% ",1,1,14,1,"identity","treatm","normal"]
[319,"GAESP_proc_obs1_a2","Hampdån","Hamp-Hanekro","GAESP","Second grading","% ",1,1,14,1,"identity","treatm","normal"]
[320,"GAESS_proc_obs1_a2","Dån","Hanekro","GAESS","Second grading","% ",1,1,14,1,"identity","treatm","normal"]
[321,"GAETE_proc_obs1_a2","Pipdån","Almindelig Hanekro","GAETE","Second grading","% ",1,1,14,1,"identity","treatm","normal"]
[322,"GALAP_proc_obs1_a2","Snärjmåra","Burresnerre","GALAP","Second grading","% ",1,1,14,1,"identity","treatm","normal"]
[323,"GERDI_proc_obs1_a2","Fliknäva","Skov-Galtetand Stachys","GERDI","Second grading","% ",1,1,14,1,"identity","treatm","normal"]
[324,"GERMO_proc_obs1_a2","Mjuknäva","Kær-Galtetand Stachys","GERMO","Second grading","% ",1,1,14,1,"identity","treatm","normal"]
[325,"GERPU_proc_obs1_a2","Sparvnäva","Storkenaeb liden","GERPU","Second grading","% ",1,1,14,1,"identity","treatm","normal"]
[326,"GERRO_proc_obs1_a2","Stinknäva","Stinkende Storkenæb","GERRO","Second grading","% ",1,1,14,1,"identity","treatm","normal"]
[327,"GERSS_proc_obs1_a2","Näva","Storkenæb","GERSS","Second grading","% ",1,1,14,1,"identity","treatm","normal"]
[328,"GGGAN_proc_obs1_a2","Gräs, Annuell","Græs","GGGAN","Second grading","% ",1,1,14,1,"identity","treatm","normal"]
[329,"HORVW_proc_obs1_a2","Spillkorn","Korn spild","HORVW","Second grading","% ",1,1,14,1,"identity","treatm","normal"]
[330,"LAMAL_proc_obs1_a2","Vitplister","Døvnælde","LAMAL","Second grading","% ",1,1,14,1,"identity","treatm","normal"]
[331,"LAMAM_proc_obs1_a2","Mjukplister","Liden Torskemund","LAMAM","Second grading","% ",1,1,14,1,"identity","treatm","normal"]
[332,"LAMIN_proc_obs1_a2","Flikplister","Fliget Tvetand","LAMIN","Second grading","% ",1,1,14,1,"identity","treatm","normal"]
[333,"LAMPU_proc_obs1_a2","Rödplister","Tvetand roed","LAMPU","Second grading","% ",1,1,14,1,"identity","treatm","normal"]
[334,"LAMSS_proc_obs1_a2","Plister","Tvetand andre","LAMSS","Second grading","% ",1,1,14,1,"identity","treatm","normal"]
[335,"LAPCO_proc_obs1_a2","Harkål","Haremad","LAPCO","Second grading","% ",1,1,14,1,"identity","treatm","normal"]
[336,"LOLMU_proc_obs1_a2","Ital Rajgräs","Rajgræs, Italiensk","LOLMU","Second grading","% ",1,1,14,1,"identity","treatm","normal"]
[337,"LOLPE_proc_obs1_a2","Eng Rajgräs","Almindelig Rajgraes","LOLPE","Second grading","% ",1,1,14,1,"identity","treatm","normal"]
[338,"MATCH_proc_obs1_a2","Kamomill","Kamille vellugtende","MATCH","Second grading","% ",1,1,14,1,"identity","treatm","normal"]
[339,"MATIN_proc_obs1_a2","Baldersbrå","Kamille lugtloes","MATIN","Second grading","% ",1,1,14,1,"identity","treatm","normal"]
[340,"MATSU_proc_obs1_a2","Gatkamomill","Kamille skive","MATSU","Second grading","% ",1,1,14,1,"identity","treatm","normal"]
[341,"MYOAR_proc_obs1_a2","Åkerförgätmigej","Forglemmigej mark","MYOAR","Second grading","% ",1,1,14,1,"identity","treatm","normal"]
[342,"MYOSS_proc_obs1_a2","Förgätmigej","Forglemmigej","MYOSS","Second grading","% ",1,1,14,1,"identity","treatm","normal"]
[343,"PAPRH_proc_obs1_a2","Kornvallmo","Valmue Korn","PAPRH","Second grading","% ",1,1,14,1,"identity","treatm","normal"]
[344,"PAPSS_proc_obs1_a2","Vallmo","Valmue","PAPSS","Second grading","% ",1,1,14,1,"identity","treatm","normal"]
[345,"PLALA_proc_obs1_a2","Svartkämpar","Lancet-Vejbred","PLALA","Second grading","% ",1,1,14,1,"identity","treatm","normal"]
[346,"PLAMA_proc_obs1_a2","Groblad","Glat Vejbred","PLAMA","Second grading","% ",1,1,14,1,"identity","treatm","normal"]
[347,"PLAME_proc_obs1_a2","Rödkämpar","Dunet Vejbred","PLAME","Second grading","% ",1,1,14,1,"identity","treatm","normal"]
[348,"POAAN_proc_obs1_a2","Vitgröe","Rapgraes enaarig","POAAN","Second grading","% ",1,1,14,1,"identity","treatm","normal"]
[349,"POLAM_proc_obs1_a2","Vattenpilört","Vand-Pileurt","POLAM","Second grading","% ",1,1,14,1,"identity","treatm","normal"]
[350,"POLAV_proc_obs1_a2","Trampört","Pileurt vej","POLAV","Second grading","% ",1,1,14,1,"identity","treatm","normal"]
[351,"POLCO_proc_obs1_a2","Åkerbinda","Snerle-Pileurt","POLCO","Second grading","% ",1,1,14,1,"identity","treatm","normal"]
[352,"POLCO_proc_obs1_a2","åkerbinda","Pileurt snerle","POLCO","Second grading","% ",1,1,14,1,"identity","treatm","normal"]
[353,"POLHY_proc_obs1_a2","Bitterpilört","Bidende Pileurt","POLHY","Second grading","% ",1,1,14,1,"identity","treatm","normal"]
[354,"POLLA_proc_obs1_a2","Vanlig Pilört","Pileurt bleg","POLLA","Second grading","% ",1,1,14,1,"identity","treatm","normal"]
[355,"POLPE_proc_obs1_a2","Åkerpilört","Pileurt fersken","POLPE","Second grading","% ",1,1,14,1,"identity","treatm","normal"]
[356,"RAPRA_proc_obs1_a2","Åkerrättika","Kiddike","RAPRA","Second grading","% ",1,1,14,1,"identity","treatm","normal"]
[357,"SENVU_proc_obs1_a2","Korsört","Brandbaeger almindelig","SENVU","Second grading","% ",1,1,14,1,"identity","treatm","normal"]
[358,"SILNO_proc_obs1_a2","Nattglim","Limurt nat","SILNO","Second grading","% ",1,1,14,1,"identity","treatm","normal"]
[359,"SINAR_proc_obs1_a2","Åkersenap","Agersennep","SINAR","Second grading","% ",1,1,14,1,"identity","treatm","normal"]
[360,"SOLNI_proc_obs1_a2","Nattskatta","Natskygge sort","SOLNI","Second grading","% ",1,1,14,1,"identity","treatm","normal"]
[361,"SOLTU_proc_obs1_a2","Potatis","Kartoffel","SOLTU","Second grading","% ",1,1,14,1,"identity","treatm","normal"]
[362,"SONAR_proc_obs1_a2","Åkermolke","Svinemaelk ager","SONAR","Second grading","% ",1,1,14,1,"identity","treatm","normal"]
[363,"SSYOF_proc_obs1_a2","Vägsenap","Rød Tvetand","SSYOF","Second grading","% ",1,1,14,1,"identity","treatm","normal"]
[364,"STAPA_proc_obs1_a2","Knölsyska","Kær-Galtetand","STAPA","Second grading","% ",1,1,14,1,"identity","treatm","normal"]
[365,"STEME_proc_obs1_a2","Våtarv","Fuglegraes","STEME","Second grading","% ",1,1,14,1,"identity","treatm","normal"]
[366,"TAROF_proc_obs1_a2","Maskros","Almindelig Mælkebøtte","TAROF","Second grading","% ",1,1,14,1,"identity","treatm","normal"]
[367,"THLAR_proc_obs1_a2","Penningört","Almindelig Pengeurt","THLAR","Second grading","% ",1,1,14,1,"identity","treatm","normal"]
[368,"TRZAW_proc_obs1_a2","Spillvete","Hvede (spildkorn)","TRZAW","Second grading","% ",1,1,14,1,"identity","treatm","normal"]
[369,"TTTTT_proc_obs1_a2","Ogräs Ospec","Ukrudt uspecificeret","TTTTT","Second grading","% ",1,1,14,1,"identity","treatm","normal"]
[370,"TUSFA_proc_obs1_a2","Hästhov","Følfod","TUSFA","Second grading","% ",1,1,14,1,"identity","treatm","normal"]
[371,"URTUR_proc_obs1_a2","Etternässla","Liden Naelde","URTUR","Second grading","% ",1,1,14,1,"identity","treatm","normal"]
[372,"VERAG_proc_obs1_a2","Åkerveronika","Flerfarvet Ærenpris","VERAG","Second grading","% ",1,1,14,1,"identity","treatm","normal"]
[373,"VERAR_proc_obs1_a2","Fältveronika","Aerenpris mark","VERAR","Second grading","% ",1,1,14,1,"identity","treatm","normal"]
[374,"VERHE_proc_obs1_a2","Murgrönsveronika","Aerenspris vedbend","VERHE","Second grading","% ",1,1,14,1,"identity","treatm","normal"]
[375,"VERPE_proc_obs1_a2","Trädgårdsveronika","Aerenpris storkronet","VERPE","Second grading","% ",1,1,14,1,"identity","treatm","normal"]
[376,"VERSS_proc_obs1_a2","Veronika","Stedmoderblomst","VERSS","Second grading","% ",1,1,14,1,"identity","treatm","normal"]
[377,"VIOAR_proc_obs1_a2","Åkerviol","Ager-Stedmoderblomst","VIOAR","Second grading","% ",1,1,14,1,"identity","treatm","normal"]
[378,"VIOSS_proc_obs1_a2","Viol","Viol","VIOSS","Second grading","% ",1,1,14,1,"identity","treatm","normal"]
[379,"AEOPO_an_obs1","Kirskål","Skvalderkål","AEOPO","First grading","Nr",1,1,14,1,"identity","treatm","normal"]
[380,"AETCY_an_obs1","Vildpersilja","Hundepersille","AETCY","First grading","Nr",1,1,14,1,"identity","treatm","normal"]
[381,"AGRRE_an_obs1","Kvickrot","Almindelig Kvik","AGRRE","First grading","Nr",1,1,14,1,"identity","treatm","normal"]
[382,"ALOMY_an_obs1","Renkavle","Ager-Rævehale","ALOMY","First grading","Nr",1,1,14,1,"identity","treatm","normal"]
[383,"ANCAR_an_obs1","Fårtunga","Krumhals","ANCAR","First grading","Nr",1,1,14,1,"identity","treatm","normal"]
[384,"ANGAR_an_obs1","Rödmire","Arve rød","ANGAR","First grading","Nr",1,1,14,1,"identity","treatm","normal"]
[385,"APESV_an_obs1","Åkerven","Vindaks","APESV","First grading","Nr",1,1,14,1,"identity","treatm","normal"]
[386,"ATXPA_an_obs1","Vägmålla","Svinemaelde","ATXPA","First grading","Nr",1,1,14,1,"identity","treatm","normal"]
[387,"AVEFA_an_obs1","Flyghavre","Flyve-Havre","AVEFA","First grading","Nr",1,1,14,1,"identity","treatm","normal"]
[388,"AVESA_an_obs1","Spillhavre","Havre","AVESA","First grading","Nr",1,1,14,1,"identity","treatm","normal"]
[389,"BBBAN_an_obs1","Tvåhjbl Arter","Ukrudt tokimbladet","BBBAN","First grading","Nr",1,1,14,1,"identity","treatm","normal"]
[390,"BRSNN_an_obs1","Spillraps","Raps","BRSNN","First grading","Nr",1,1,14,1,"identity","treatm","normal"]
[391,"CAPBP_an_obs1","Lomme","Hyrdetaske","CAPBP","First grading","Nr",1,1,14,1,"identity","treatm","normal"]
[392,"CENCY_an_obs1","Blåklint","Kornblomst","CENCY","First grading","Nr",1,1,14,1,"identity","treatm","normal"]
[393,"CHEAL_an_obs1","Svinmålla","Gaasefod hvidmelet","CHEAL","First grading","Nr",1,1,14,1,"identity","treatm","normal"]
[394,"CHESS_an_obs1","Målla","Gåsefod-Arter","CHESS","First grading","Nr",1,1,14,1,"identity","treatm","normal"]
[395,"CIRAR_an_obs1","Åkertistel","Agertidsel","CIRAR","First grading","Nr",1,1,14,1,"identity","treatm","normal"]
[396,"CONAR_an_obs1","Åkervinda","Ager-Snerle","CONAR","First grading","Nr",1,1,14,1,"identity","treatm","normal"]
[397,"CRDAR_an_obs1","Sandtrav","Almindelig Sandkarse","CRDAR","First grading","Nr",1,1,14,1,"identity","treatm","normal"]
[398,"ECHCG_an_obs1","Hönshirs","Almindelig Hanespore","ECHCG","First grading","Nr",1,1,14,1,"identity","treatm","normal"]
[399,"EPHEX_an_obs1","Småtörel","Vortemaelk liden","EPHEX","First grading","Nr",1,1,14,1,"identity","treatm","normal"]
[400,"EPHHE_an_obs1","Revormstörel","Skaerm-Vortemaelk","EPHHE","First grading","Nr",1,1,14,1,"identity","treatm","normal"]
[401,"EQUAR_an_obs1","Åkerfräken","Ager-Padderok","EQUAR","First grading","Nr",1,1,14,1,"identity","treatm","normal"]
[402,"EROCI_an_obs1","Skatnäva","Hejrenaeb","EROCI","First grading","Nr",1,1,14,1,"identity","treatm","normal"]
[403,"FUMOF_an_obs1","Jordrök","Laege-Jordrøg","FUMOF","First grading","Nr",1,1,14,1,"identity","treatm","normal"]
[404,"GAEBI_an_obs1","Toppdån","Skov-Hanekro","GAEBI","First grading","Nr",1,1,14,1,"identity","treatm","normal"]
[405,"GAELA_an_obs1","Mjukdån","Sand-Hanekro","GAELA","First grading","Nr",1,1,14,1,"identity","treatm","normal"]
[406,"GAESP_an_obs1","Hampdån","Hamp-Hanekro","GAESP","First grading","Nr",1,1,14,1,"identity","treatm","normal"]
[407,"GAESS_an_obs1","Dån","Hanekro","GAESS","First grading","Nr",1,1,14,1,"identity","treatm","normal"]
[408,"GAETE_an_obs1","Pipdån","Almindelig Hanekro","GAETE","First grading","Nr",1,1,14,1,"identity","treatm","normal"]
[409,"GALAP_an_obs1","Snärjmåra","Burresnerre","GALAP","First grading","Nr",1,1,14,1,"identity","treatm","normal"]
[410,"GERDI_an_obs1","Fliknäva","Skov-Galtetand Stachys","GERDI","First grading","Nr",1,1,14,1,"identity","treatm","normal"]
[411,"GERMO_an_obs1","Mjuknäva","Kær-Galtetand Stachys","GERMO","First grading","Nr",1,1,14,1,"identity","treatm","normal"]
[412,"GERPU_an_obs1","Sparvnäva","Storkenaeb liden","GERPU","First grading","Nr",1,1,14,1,"identity","treatm","normal"]
[413,"GERRO_an_obs1","Stinknäva","Stinkende Storkenæb","GERRO","First grading","Nr",1,1,14,1,"identity","treatm","normal"]
[414,"GERSS_an_obs1","Näva","Storkenæb","GERSS","First grading","Nr",1,1,14,1,"identity","treatm","normal"]
[415,"GGGAN_an_obs1","Gräs, Annuell","Græs","GGGAN","First grading","Nr",1,1,14,1,"identity","treatm","normal"]
[416,"HORVW_an_obs1","Spillkorn","Korn spild","HORVW","First grading","Nr",1,1,14,1,"identity","treatm","normal"]
[417,"LAMAL_an_obs1","Vitplister","Døvnælde","LAMAL","First grading","Nr",1,1,14,1,"identity","treatm","normal"]
[418,"LAMAM_an_obs1","Mjukplister","Liden Torskemund","LAMAM","First grading","Nr",1,1,14,1,"identity","treatm","normal"]
[419,"LAMIN_an_obs1","Flikplister","Fliget Tvetand","LAMIN","First grading","Nr",1,1,14,1,"identity","treatm","normal"]
[420,"LAMPU_an_obs1","Rödplister","Tvetand roed","LAMPU","First grading","Nr",1,1,14,1,"identity","treatm","normal"]
[421,"LAMSS_an_obs1","Plister","Tvetand andre","LAMSS","First grading","Nr",1,1,14,1,"identity","treatm","normal"]
[422,"LAPCO_an_obs1","Harkål","Haremad","LAPCO","First grading","Nr",1,1,14,1,"identity","treatm","normal"]
[423,"LOLMU_an_obs1","Ital Rajgräs","Rajgræs, Italiensk","LOLMU","First grading","Nr",1,1,14,1,"identity","treatm","normal"]
[424,"LOLPE_an_obs1","Eng Rajgräs","Almindelig Rajgraes","LOLPE","First grading","Nr",1,1,14,1,"identity","treatm","normal"]
[425,"MATCH_an_obs1","Kamomill","Kamille vellugtende","MATCH","First grading","Nr",1,1,14,1,"identity","treatm","normal"]
[426,"MATIN_an_obs1","Baldersbrå","Kamille lugtloes","MATIN","First grading","Nr",1,1,14,1,"identity","treatm","normal"]
[427,"MATSU_an_obs1","Gatkamomill","Kamille skive","MATSU","First grading","Nr",1,1,14,1,"identity","treatm","normal"]
[428,"MYOAR_an_obs1","Åkerförgätmigej","Forglemmigej mark","MYOAR","First grading","Nr",1,1,14,1,"identity","treatm","normal"]
[429,"MYOSS_an_obs1","Förgätmigej","Forglemmigej","MYOSS","First grading","Nr",1,1,14,1,"identity","treatm","normal"]
[430,"PAPRH_an_obs1","Kornvallmo","Valmue Korn","PAPRH","First grading","Nr",1,1,14,1,"identity","treatm","normal"]
[431,"PAPSS_an_obs1","Vallmo","Valmue","PAPSS","First grading","Nr",1,1,14,1,"identity","treatm","normal"]
[432,"PLALA_an_obs1","Svartkämpar","Lancet-Vejbred","PLALA","First grading","Nr",1,1,14,1,"identity","treatm","normal"]
[433,"PLAMA_an_obs1","Groblad","Glat Vejbred","PLAMA","First grading","Nr",1,1,14,1,"identity","treatm","normal"]
[434,"PLAME_an_obs1","Rödkämpar","Dunet Vejbred","PLAME","First grading","Nr",1,1,14,1,"identity","treatm","normal"]
[435,"POAAN_an_obs1","Vitgröe","Rapgraes enaarig","POAAN","First grading","Nr",1,1,14,1,"identity","treatm","normal"]
[436,"POLAM_an_obs1","Vattenpilört","Vand-Pileurt","POLAM","First grading","Nr",1,1,14,1,"identity","treatm","normal"]
[437,"POLAV_an_obs1","Trampört","Pileurt vej","POLAV","First grading","Nr",1,1,14,1,"identity","treatm","normal"]
[438,"POLCO_an_obs1","Åkerbinda","Snerle-Pileurt","POLCO","First grading","Nr",1,1,14,1,"identity","treatm","normal"]
[439,"POLCO_an_obs1","åkerbinda","Pileurt snerle","POLCO","First grading","Nr",1,1,14,1,"identity","treatm","normal"]
[440,"POLHY_an_obs1","Bitterpilört","Bidende Pileurt","POLHY","First grading","Nr",1,1,14,1,"identity","treatm","normal"]
[441,"POLLA_an_obs1","Vanlig Pilört","Pileurt bleg","POLLA","First grading","Nr",1,1,14,1,"identity","treatm","normal"]
[442,"POLPE_an_obs1","Åkerpilört","Pileurt fersken","POLPE","First grading","Nr",1,1,14,1,"identity","treatm","normal"]
[443,"RAPRA_an_obs1","Åkerrättika","Kiddike","RAPRA","First grading","Nr",1,1,14,1,"identity","treatm","normal"]
[444,"SENVU_an_obs1","Korsört","Brandbaeger almindelig","SENVU","First grading","Nr",1,1,14,1,"identity","treatm","normal"]
[445,"SILNO_an_obs1","Nattglim","Limurt nat","SILNO","First grading","Nr",1,1,14,1,"identity","treatm","normal"]
[446,"SINAR_an_obs1","Åkersenap","Agersennep","SINAR","First grading","Nr",1,1,14,1,"identity","treatm","normal"]
[447,"SOLNI_an_obs1","Nattskatta","Natskygge sort","SOLNI","First grading","Nr",1,1,14,1,"identity","treatm","normal"]
[448,"SOLTU_an_obs1","Potatis","Kartoffel","SOLTU","First grading","Nr",1,1,14,1,"identity","treatm","normal"]
[449,"SONAR_an_obs1","Åkermolke","Svinemaelk ager","SONAR","First grading","Nr",1,1,14,1,"identity","treatm","normal"]
[450,"SSYOF_an_obs1","Vägsenap","Rød Tvetand","SSYOF","First grading","Nr",1,1,14,1,"identity","treatm","normal"]
[451,"STAPA_an_obs1","Knölsyska","Kær-Galtetand","STAPA","First grading","Nr",1,1,14,1,"identity","treatm","normal"]
[452,"STEME_an_obs1","Våtarv","Fuglegraes","STEME","First grading","Nr",1,1,14,1,"identity","treatm","normal"]
[453,"TAROF_an_obs1","Maskros","Almindelig Mælkebøtte","TAROF","First grading","Nr",1,1,14,1,"identity","treatm","normal"]
[454,"THLAR_an_obs1","Penningört","Almindelig Pengeurt","THLAR","First grading","Nr",1,1,14,1,"identity","treatm","normal"]
[455,"TRZAW_an_obs1","Spillvete","Hvede (spildkorn)","TRZAW","First grading","Nr",1,1,14,1,"identity","treatm","normal"]
[456,"TTTTT_an_obs1","Ogräs Ospec","Ukrudt uspecificeret","TTTTT","First grading","Nr",1,1,14,1,"identity","treatm","normal"]
[457,"TUSFA_an_obs1","Hästhov","Følfod","TUSFA","First grading","Nr",1,1,14,1,"identity","treatm","normal"]
[458,"URTUR_an_obs1","Etternässla","Liden Naelde","URTUR","First grading","Nr",1,1,14,1,"identity","treatm","normal"]
[459,"VERAG_an_obs1","Åkerveronika","Flerfarvet Ærenpris","VERAG","First grading","Nr",1,1,14,1,"identity","treatm","normal"]
[460,"VERAR_an_obs1","Fältveronika","Aerenpris mark","VERAR","First grading","Nr",1,1,14,1,"identity","treatm","normal"]
[461,"VERHE_an_obs1","Murgrönsveronika","Aerenspris vedbend","VERHE","First grading","Nr",1,1,14,1,"identity","treatm","normal"]
[462,"VERPE_an_obs1","Trädgårdsveronika","Aerenpris storkronet","VERPE","First grading","Nr",1,1,14,1,"identity","treatm","normal"]
[463,"VERSS_an_obs1","Veronika","Stedmoderblomst","VERSS","First grading","Nr",1,1,14,1,"identity","treatm","normal"]
[464,"VIOAR_an_obs1","Åkerviol","Ager-Stedmoderblomst","VIOAR","First grading","Nr",1,1,14,1,"identity","treatm","normal"]
[465,"VIOSS_an_obs1","Viol","Viol","VIOSS","First grading","Nr",1,1,14,1,"identity","treatm","normal"]
[466,"AEOPO_an_obs1_a2","Kirskål","Skvalderkål","AEOPO","Second grading","Nr",1,1,14,1,"identity","treatm","normal"]
[467,"AETCY_an_obs1_a2","Vildpersilja","Hundepersille","AETCY","Second grading","Nr",1,1,14,1,"identity","treatm","normal"]
[468,"AGRRE_an_obs1_a2","Kvickrot","Almindelig Kvik","AGRRE","Second grading","Nr",1,1,14,1,"identity","treatm","normal"]
[469,"ALOMY_an_obs1_a2","Renkavle","Ager-Rævehale","ALOMY","Second grading","Nr",1,1,14,1,"identity","treatm","normal"]
[470,"ANCAR_an_obs1_a2","Fårtunga","Krumhals","ANCAR","Second grading","Nr",1,1,14,1,"identity","treatm","normal"]
[471,"ANGAR_an_obs1_a2","Rödmire","Arve rød","ANGAR","Second grading","Nr",1,1,14,1,"identity","treatm","normal"]
[472,"APESV_an_obs1_a2","Åkerven","Vindaks","APESV","Second grading","Nr",1,1,14,1,"identity","treatm","normal"]
[473,"ATXPA_an_obs1_a2","Vägmålla","Svinemaelde","ATXPA","Second grading","Nr",1,1,14,1,"identity","treatm","normal"]
[474,"AVEFA_an_obs1_a2","Flyghavre","Flyve-Havre","AVEFA","Second grading","Nr",1,1,14,1,"identity","treatm","normal"]
[475,"AVESA_an_obs1_a2","Spillhavre","Havre","AVESA","Second grading","Nr",1,1,14,1,"identity","treatm","normal"]
[476,"BBBAN_an_obs1_a2","Tvåhjbl Arter","Ukrudt tokimbladet","BBBAN","Second grading","Nr",1,1,14,1,"identity","treatm","normal"]
[477,"BRSNN_an_obs1_a2","Spillraps","Raps","BRSNN","Second grading","Nr",1,1,14,1,"identity","treatm","normal"]
[478,"CAPBP_an_obs1_a2","Lomme","Hyrdetaske","CAPBP","Second grading","Nr",1,1,14,1,"identity","treatm","normal"]
[479,"CENCY_an_obs1_a2","Blåklint","Kornblomst","CENCY","Second grading","Nr",1,1,14,1,"identity","treatm","normal"]
[480,"CHEAL_an_obs1_a2","Svinmålla","Gaasefod hvidmelet","CHEAL","Second grading","Nr",1,1,14,1,"identity","treatm","normal"]
[481,"CHESS_an_obs1_a2","Målla","Gåsefod-Arter","CHESS","Second grading","Nr",1,1,14,1,"identity","treatm","normal"]
[482,"CIRAR_an_obs1_a2","Åkertistel","Agertidsel","CIRAR","Second grading","Nr",1,1,14,1,"identity","treatm","normal"]
[483,"CONAR_an_obs1_a2","Åkervinda","Ager-Snerle","CONAR","Second grading","Nr",1,1,14,1,"identity","treatm","normal"]
[484,"CRDAR_an_obs1_a2","Sandtrav","Almindelig Sandkarse","CRDAR","Second grading","Nr",1,1,14,1,"identity","treatm","normal"]
[485,"ECHCG_an_obs1_a2","Hönshirs","Almindelig Hanespore","ECHCG","Second grading","Nr",1,1,14,1,"identity","treatm","normal"]
[486,"EPHEX_an_obs1_a2","Småtörel","Vortemaelk liden","EPHEX","Second grading","Nr",1,1,14,1,"identity","treatm","normal"]
[487,"EPHHE_an_obs1_a2","Revormstörel","Skaerm-Vortemaelk","EPHHE","Second grading","Nr",1,1,14,1,"identity","treatm","normal"]
[488,"EQUAR_an_obs1_a2","Åkerfräken","Ager-Padderok","EQUAR","Second grading","Nr",1,1,14,1,"identity","treatm","normal"]
[489,"EROCI_an_obs1_a2","Skatnäva","Hejrenaeb","EROCI","Second grading","Nr",1,1,14,1,"identity","treatm","normal"]
[490,"FUMOF_an_obs1_a2","Jordrök","Laege-Jordrøg","FUMOF","Second grading","Nr",1,1,14,1,"identity","treatm","normal"]
[491,"GAEBI_an_obs1_a2","Toppdån","Skov-Hanekro","GAEBI","Second grading","Nr",1,1,14,1,"identity","treatm","normal"]
[492,"GAELA_an_obs1_a2","Mjukdån","Sand-Hanekro","GAELA","Second grading","Nr",1,1,14,1,"identity","treatm","normal"]
[493,"GAESP_an_obs1_a2","Hampdån","Hamp-Hanekro","GAESP","Second grading","Nr",1,1,14,1,"identity","treatm","normal"]
[494,"GAESS_an_obs1_a2","Dån","Hanekro","GAESS","Second grading","Nr",1,1,14,1,"identity","treatm","normal"]
[495,"GAETE_an_obs1_a2","Pipdån","Almindelig Hanekro","GAETE","Second grading","Nr",1,1,14,1,"identity","treatm","normal"]
[496,"GALAP_an_obs1_a2","Snärjmåra","Burresnerre","GALAP","Second grading","Nr",1,1,14,1,"identity","treatm","normal"]
[497,"GERDI_an_obs1_a2","Fliknäva","Skov-Galtetand Stachys","GERDI","Second grading","Nr",1,1,14,1,"identity","treatm","normal"]
[498,"GERMO_an_obs1_a2","Mjuknäva","Kær-Galtetand Stachys","GERMO","Second grading","Nr",1,1,14,1,"identity","treatm","normal"]
[499,"GERPU_an_obs1_a2","Sparvnäva","Storkenaeb liden","GERPU","Second grading","Nr",1,1,14,1,"identity","treatm","normal"]
[500,"GERRO_an_obs1_a2","Stinknäva","Stinkende Storkenæb","GERRO","Second grading","Nr",1,1,14,1,"identity","treatm","normal"]
[501,"GERSS_an_obs1_a2","Näva","Storkenæb","GERSS","Second grading","Nr",1,1,14,1,"identity","treatm","normal"]
[502,"GGGAN_an_obs1_a2","Gräs, Annuell","Græs","GGGAN","Second grading","Nr",1,1,14,1,"identity","treatm","normal"]
[503,"HORVW_an_obs1_a2","Spillkorn","Korn spild","HORVW","Second grading","Nr",1,1,14,1,"identity","treatm","normal"]
[504,"LAMAL_an_obs1_a2","Vitplister","Døvnælde","LAMAL","Second grading","Nr",1,1,14,1,"identity","treatm","normal"]
[505,"LAMAM_an_obs1_a2","Mjukplister","Liden Torskemund","LAMAM","Second grading","Nr",1,1,14,1,"identity","treatm","normal"]
[506,"LAMIN_an_obs1_a2","Flikplister","Fliget Tvetand","LAMIN","Second grading","Nr",1,1,14,1,"identity","treatm","normal"]
[507,"LAMPU_an_obs1_a2","Rödplister","Tvetand roed","LAMPU","Second grading","Nr",1,1,14,1,"identity","treatm","normal"]
[508,"LAMSS_an_obs1_a2","Plister","Tvetand andre","LAMSS","Second grading","Nr",1,1,14,1,"identity","treatm","normal"]
[509,"LAPCO_an_obs1_a2","Harkål","Haremad","LAPCO","Second grading","Nr",1,1,14,1,"identity","treatm","normal"]
[510,"LOLMU_an_obs1_a2","Ital Rajgräs","Rajgræs, Italiensk","LOLMU","Second grading","Nr",1,1,14,1,"identity","treatm","normal"]
[511,"LOLPE_an_obs1_a2","Eng Rajgräs","Almindelig Rajgraes","LOLPE","Second grading","Nr",1,1,14,1,"identity","treatm","normal"]
[512,"MATCH_an_obs1_a2","Kamomill","Kamille vellugtende","MATCH","Second grading","Nr",1,1,14,1,"identity","treatm","normal"]
[513,"MATIN_an_obs1_a2","Baldersbrå","Kamille lugtloes","MATIN","Second grading","Nr",1,1,14,1,"identity","treatm","normal"]
[514,"MATSU_an_obs1_a2","Gatkamomill","Kamille skive","MATSU","Second grading","Nr",1,1,14,1,"identity","treatm","normal"]
[515,"MYOAR_an_obs1_a2","Åkerförgätmigej","Forglemmigej mark","MYOAR","Second grading","Nr",1,1,14,1,"identity","treatm","normal"]
[516,"MYOSS_an_obs1_a2","Förgätmigej","Forglemmigej","MYOSS","Second grading","Nr",1,1,14,1,"identity","treatm","normal"]
[517,"PAPRH_an_obs1_a2","Kornvallmo","Valmue Korn","PAPRH","Second grading","Nr",1,1,14,1,"identity","treatm","normal"]
[518,"PAPSS_an_obs1_a2","Vallmo","Valmue","PAPSS","Second grading","Nr",1,1,14,1,"identity","treatm","normal"]
[519,"PLALA_an_obs1_a2","Svartkämpar","Lancet-Vejbred","PLALA","Second grading","Nr",1,1,14,1,"identity","treatm","normal"]
[520,"PLAMA_an_obs1_a2","Groblad","Glat Vejbred","PLAMA","Second grading","Nr",1,1,14,1,"identity","treatm","normal"]
[521,"PLAME_an_obs1_a2","Rödkämpar","Dunet Vejbred","PLAME","Second grading","Nr",1,1,14,1,"identity","treatm","normal"]
[522,"POAAN_an_obs1_a2","Vitgröe","Rapgraes enaarig","POAAN","Second grading","Nr",1,1,14,1,"identity","treatm","normal"]
[523,"POLAM_an_obs1_a2","Vattenpilört","Vand-Pileurt","POLAM","Second grading","Nr",1,1,14,1,"identity","treatm","normal"]
[524,"POLAV_an_obs1_a2","Trampört","Pileurt vej","POLAV","Second grading","Nr",1,1,14,1,"identity","treatm","normal"]
[525,"POLCO_an_obs1_a2","Åkerbinda","Snerle-Pileurt","POLCO","Second grading","Nr",1,1,14,1,"identity","treatm","normal"]
[526,"POLCO_an_obs1_a2","åkerbinda","Pileurt snerle","POLCO","Second grading","Nr",1,1,14,1,"identity","treatm","normal"]
[527,"POLHY_an_obs1_a2","Bitterpilört","Bidende Pileurt","POLHY","Second grading","Nr",1,1,14,1,"identity","treatm","normal"]
[528,"POLLA_an_obs1_a2","Vanlig Pilört","Pileurt bleg","POLLA","Second grading","Nr",1,1,14,1,"identity","treatm","normal"]
[529,"POLPE_an_obs1_a2","Åkerpilört","Pileurt fersken","POLPE","Second grading","Nr",1,1,14,1,"identity","treatm","normal"]
[530,"RAPRA_an_obs1_a2","Åkerrättika","Kiddike","RAPRA","Second grading","Nr",1,1,14,1,"identity","treatm","normal"]
[531,"SENVU_an_obs1_a2","Korsört","Brandbaeger almindelig","SENVU","Second grading","Nr",1,1,14,1,"identity","treatm","normal"]
[532,"SILNO_an_obs1_a2","Nattglim","Limurt nat","SILNO","Second grading","Nr",1,1,14,1,"identity","treatm","normal"]
[533,"SINAR_an_obs1_a2","Åkersenap","Agersennep","SINAR","Second grading","Nr",1,1,14,1,"identity","treatm","normal"]
[534,"SOLNI_an_obs1_a2","Nattskatta","Natskygge sort","SOLNI","Second grading","Nr",1,1,14,1,"identity","treatm","normal"]
[535,"SOLTU_an_obs1_a2","Potatis","Kartoffel","SOLTU","Second grading","Nr",1,1,14,1,"identity","treatm","normal"]
[536,"SONAR_an_obs1_a2","Åkermolke","Svinemaelk ager","SONAR","Second grading","Nr",1,1,14,1,"identity","treatm","normal"]
[537,"SSYOF_an_obs1_a2","Vägsenap","Rød Tvetand","SSYOF","Second grading","Nr",1,1,14,1,"identity","treatm","normal"]
[538,"STAPA_an_obs1_a2","Knölsyska","Kær-Galtetand","STAPA","Second grading","Nr",1,1,14,1,"identity","treatm","normal"]
[539,"STEME_an_obs1_a2","Våtarv","Fuglegraes","STEME","Second grading","Nr",1,1,14,1,"identity","treatm","normal"]
[540,"TAROF_an_obs1_a2","Maskros","Almindelig Mælkebøtte","TAROF","Second grading","Nr",1,1,14,1,"identity","treatm","normal"]
[541,"THLAR_an_obs1_a2","Penningört","Almindelig Pengeurt","THLAR","Second grading","Nr",1,1,14,1,"identity","treatm","normal"]
[542,"TRZAW_an_obs1_a2","Spillvete","Hvede (spildkorn)","TRZAW","Second grading","Nr",1,1,14,1,"identity","treatm","normal"]
[543,"TTTTT_an_obs1_a2","Ogräs Ospec","Ukrudt uspecificeret","TTTTT","Second grading","Nr",1,1,14,1,"identity","treatm","normal"]
[544,"TUSFA_an_obs1_a2","Hästhov","Følfod","TUSFA","Second grading","Nr",1,1,14,1,"identity","treatm","normal"]
[545,"URTUR_an_obs1_a2","Etternässla","Liden Naelde","URTUR","Second grading","Nr",1,1,14,1,"identity","treatm","normal"]
[546,"VERAG_an_obs1_a2","Åkerveronika","Flerfarvet Ærenpris","VERAG","Second grading","Nr",1,1,14,1,"identity","treatm","normal"]
[547,"VERAR_an_obs1_a2","Fältveronika","Aerenpris mark","VERAR","Second grading","Nr",1,1,14,1,"identity","treatm","normal"]
[548,"VERHE_an_obs1_a2","Murgrönsveronika","Aerenspris vedbend","VERHE","Second grading","Nr",1,1,14,1,"identity","treatm","normal"]
[549,"VERPE_an_obs1_a2","Trädgårdsveronika","Aerenpris storkronet","VERPE","Second grading","Nr",1,1,14,1,"identity","treatm","normal"]
[550,"VERSS_an_obs1_a2","Veronika","Stedmoderblomst","VERSS","Second grading","Nr",1,1,14,1,"identity","treatm","normal"]
[551,"VIOAR_an_obs1_a2","Åkerviol","Ager-Stedmoderblomst","VIOAR","Second grading","Nr",1,1,14,1,"identity","treatm","normal"]
[552,"VIOSS_an_obs1_a2","Viol","Viol","VIOSS","Second grading","Nr",1,1,14,1,"identity","treatm","normal"]
[553,"AEOPO_eff_obs1","Kirskål","Skvalderkål","AEOPO","First grading","Efficacy",1,1,14,1,"identity","treatm","normal"]
[554,"AETCY_eff_obs1","Vildpersilja","Hundepersille","AETCY","First grading","Efficacy",1,1,14,1,"identity","treatm","normal"]
[555,"AGRRE_eff_obs1","Kvickrot","Almindelig Kvik","AGRRE","First grading","Efficacy",1,1,14,1,"identity","treatm","normal"]
[556,"ALOMY_eff_obs1","Renkavle","Ager-Rævehale","ALOMY","First grading","Efficacy",1,1,14,1,"identity","treatm","normal"]
[557,"ANCAR_eff_obs1","Fårtunga","Krumhals","ANCAR","First grading","Efficacy",1,1,14,1,"identity","treatm","normal"]
[558,"ANGAR_eff_obs1","Rödmire","Arve rød","ANGAR","First grading","Efficacy",1,1,14,1,"identity","treatm","normal"]
[559,"APESV_eff_obs1","Åkerven","Vindaks","APESV","First grading","Efficacy",1,1,14,1,"identity","treatm","normal"]
[560,"ATXPA_eff_obs1","Vägmålla","Svinemaelde","ATXPA","First grading","Efficacy",1,1,14,1,"identity","treatm","normal"]
[561,"AVEFA_eff_obs1","Flyghavre","Flyve-Havre","AVEFA","First grading","Efficacy",1,1,14,1,"identity","treatm","normal"]
[562,"AVESA_eff_obs1","Spillhavre","Havre","AVESA","First grading","Efficacy",1,1,14,1,"identity","treatm","normal"]
[563,"BBBAN_eff_obs1","Tvåhjbl Arter","Ukrudt tokimbladet","BBBAN","First grading","Efficacy",1,1,14,1,"identity","treatm","normal"]
[564,"BRSNN_eff_obs1","Spillraps","Raps","BRSNN","First grading","Efficacy",1,1,14,1,"identity","treatm","normal"]
[565,"CAPBP_eff_obs1","Lomme","Hyrdetaske","CAPBP","First grading","Efficacy",1,1,14,1,"identity","treatm","normal"]
[566,"CENCY_eff_obs1","Blåklint","Kornblomst","CENCY","First grading","Efficacy",1,1,14,1,"identity","treatm","normal"]
[567,"CHEAL_eff_obs1","Svinmålla","Gaasefod hvidmelet","CHEAL","First grading","Efficacy",1,1,14,1,"identity","treatm","normal"]
[568,"CHESS_eff_obs1","Målla","Gåsefod-Arter","CHESS","First grading","Efficacy",1,1,14,1,"identity","treatm","normal"]
[569,"CIRAR_eff_obs1","Åkertistel","Agertidsel","CIRAR","First grading","Efficacy",1,1,14,1,"identity","treatm","normal"]
[570,"CONAR_eff_obs1","Åkervinda","Ager-Snerle","CONAR","First grading","Efficacy",1,1,14,1,"identity","treatm","normal"]
[571,"CRDAR_eff_obs1","Sandtrav","Almindelig Sandkarse","CRDAR","First grading","Efficacy",1,1,14,1,"identity","treatm","normal"]
[572,"ECHCG_eff_obs1","Hönshirs","Almindelig Hanespore","ECHCG","First grading","Efficacy",1,1,14,1,"identity","treatm","normal"]
[573,"EPHEX_eff_obs1","Småtörel","Vortemaelk liden","EPHEX","First grading","Efficacy",1,1,14,1,"identity","treatm","normal"]
[574,"EPHHE_eff_obs1","Revormstörel","Skaerm-Vortemaelk","EPHHE","First grading","Efficacy",1,1,14,1,"identity","treatm","normal"]
[575,"EQUAR_eff_obs1","Åkerfräken","Ager-Padderok","EQUAR","First grading","Efficacy",1,1,14,1,"identity","treatm","normal"]
[576,"EROCI_eff_obs1","Skatnäva","Hejrenaeb","EROCI","First grading","Efficacy",1,1,14,1,"identity","treatm","normal"]
[577,"FUMOF_eff_obs1","Jordrök","Laege-Jordrøg","FUMOF","First grading","Efficacy",1,1,14,1,"identity","treatm","normal"]
[578,"GAEBI_eff_obs1","Toppdån","Skov-Hanekro","GAEBI","First grading","Efficacy",1,1,14,1,"identity","treatm","normal"]
[579,"GAELA_eff_obs1","Mjukdån","Sand-Hanekro","GAELA","First grading","Efficacy",1,1,14,1,"identity","treatm","normal"]
[580,"GAESP_eff_obs1","Hampdån","Hamp-Hanekro","GAESP","First grading","Efficacy",1,1,14,1,"identity","treatm","normal"]
[581,"GAESS_eff_obs1","Dån","Hanekro","GAESS","First grading","Efficacy",1,1,14,1,"identity","treatm","normal"]
[582,"GAETE_eff_obs1","Pipdån","Almindelig Hanekro","GAETE","First grading","Efficacy",1,1,14,1,"identity","treatm","normal"]
[583,"GALAP_eff_obs1","Snärjmåra","Burresnerre","GALAP","First grading","Efficacy",1,1,14,1,"identity","treatm","normal"]
[584,"GERDI_eff_obs1","Fliknäva","Skov-Galtetand Stachys","GERDI","First grading","Efficacy",1,1,14,1,"identity","treatm","normal"]
[585,"GERMO_eff_obs1","Mjuknäva","Kær-Galtetand Stachys","GERMO","First grading","Efficacy",1,1,14,1,"identity","treatm","normal"]
[586,"GERPU_eff_obs1","Sparvnäva","Storkenaeb liden","GERPU","First grading","Efficacy",1,1,14,1,"identity","treatm","normal"]
[587,"GERRO_eff_obs1","Stinknäva","Stinkende Storkenæb","GERRO","First grading","Efficacy",1,1,14,1,"identity","treatm","normal"]
[588,"GERSS_eff_obs1","Näva","Storkenæb","GERSS","First grading","Efficacy",1,1,14,1,"identity","treatm","normal"]
[589,"GGGAN_eff_obs1","Gräs, Annuell","Græs","GGGAN","First grading","Efficacy",1,1,14,1,"identity","treatm","normal"]
[590,"HORVW_eff_obs1","Spillkorn","Korn spild","HORVW","First grading","Efficacy",1,1,14,1,"identity","treatm","normal"]
[591,"LAMAL_eff_obs1","Vitplister","Døvnælde","LAMAL","First grading","Efficacy",1,1,14,1,"identity","treatm","normal"]
[592,"LAMAM_eff_obs1","Mjukplister","Liden Torskemund","LAMAM","First grading","Efficacy",1,1,14,1,"identity","treatm","normal"]
[593,"LAMIN_eff_obs1","Flikplister","Fliget Tvetand","LAMIN","First grading","Efficacy",1,1,14,1,"identity","treatm","normal"]
[594,"LAMPU_eff_obs1","Rödplister","Tvetand roed","LAMPU","First grading","Efficacy",1,1,14,1,"identity","treatm","normal"]
[595,"LAMSS_eff_obs1","Plister","Tvetand andre","LAMSS","First grading","Efficacy",1,1,14,1,"identity","treatm","normal"]
[596,"LAPCO_eff_obs1","Harkål","Haremad","LAPCO","First grading","Efficacy",1,1,14,1,"identity","treatm","normal"]
[597,"LOLMU_eff_obs1","Ital Rajgräs","Rajgræs, Italiensk","LOLMU","First grading","Efficacy",1,1,14,1,"identity","treatm","normal"]
[598,"LOLPE_eff_obs1","Eng Rajgräs","Almindelig Rajgraes","LOLPE","First grading","Efficacy",1,1,14,1,"identity","treatm","normal"]
[599,"MATCH_eff_obs1","Kamomill","Kamille vellugtende","MATCH","First grading","Efficacy",1,1,14,1,"identity","treatm","normal"]
[600,"MATIN_eff_obs1","Baldersbrå","Kamille lugtloes","MATIN","First grading","Efficacy",1,1,14,1,"identity","treatm","normal"]
[601,"MATSU_eff_obs1","Gatkamomill","Kamille skive","MATSU","First grading","Efficacy",1,1,14,1,"identity","treatm","normal"]
[602,"MYOAR_eff_obs1","Åkerförgätmigej","Forglemmigej mark","MYOAR","First grading","Efficacy",1,1,14,1,"identity","treatm","normal"]
[603,"MYOSS_eff_obs1","Förgätmigej","Forglemmigej","MYOSS","First grading","Efficacy",1,1,14,1,"identity","treatm","normal"]
[604,"PAPRH_eff_obs1","Kornvallmo","Valmue Korn","PAPRH","First grading","Efficacy",1,1,14,1,"identity","treatm","normal"]
[605,"PAPSS_eff_obs1","Vallmo","Valmue","PAPSS","First grading","Efficacy",1,1,14,1,"identity","treatm","normal"]
[606,"PLALA_eff_obs1","Svartkämpar","Lancet-Vejbred","PLALA","First grading","Efficacy",1,1,14,1,"identity","treatm","normal"]
[607,"PLAMA_eff_obs1","Groblad","Glat Vejbred","PLAMA","First grading","Efficacy",1,1,14,1,"identity","treatm","normal"]
[608,"PLAME_eff_obs1","Rödkämpar","Dunet Vejbred","PLAME","First grading","Efficacy",1,1,14,1,"identity","treatm","normal"]
[609,"POAAN_eff_obs1","Vitgröe","Rapgraes enaarig","POAAN","First grading","Efficacy",1,1,14,1,"identity","treatm","normal"]
[610,"POLAM_eff_obs1","Vattenpilört","Vand-Pileurt","POLAM","First grading","Efficacy",1,1,14,1,"identity","treatm","normal"]
[611,"POLAV_eff_obs1","Trampört","Pileurt vej","POLAV","First grading","Efficacy",1,1,14,1,"identity","treatm","normal"]
[612,"POLCO_eff_obs1","Åkerbinda","Snerle-Pileurt","POLCO","First grading","Efficacy",1,1,14,1,"identity","treatm","normal"]
[613,"POLCO_eff_obs1","åkerbinda","Pileurt snerle","POLCO","First grading","Efficacy",1,1,14,1,"identity","treatm","normal"]
[614,"POLHY_eff_obs1","Bitterpilört","Bidende Pileurt","POLHY","First grading","Efficacy",1,1,14,1,"identity","treatm","normal"]
[615,"POLLA_eff_obs1","Vanlig Pilört","Pileurt bleg","POLLA","First grading","Efficacy",1,1,14,1,"identity","treatm","normal"]
[616,"POLPE_eff_obs1","Åkerpilört","Pileurt fersken","POLPE","First grading","Efficacy",1,1,14,1,"identity","treatm","normal"]
[617,"RAPRA_eff_obs1","Åkerrättika","Kiddike","RAPRA","First grading","Efficacy",1,1,14,1,"identity","treatm","normal"]
[618,"SENVU_eff_obs1","Korsört","Brandbaeger almindelig","SENVU","First grading","Efficacy",1,1,14,1,"identity","treatm","normal"]
[619,"SILNO_eff_obs1","Nattglim","Limurt nat","SILNO","First grading","Efficacy",1,1,14,1,"identity","treatm","normal"]
[620,"SINAR_eff_obs1","Åkersenap","Agersennep","SINAR","First grading","Efficacy",1,1,14,1,"identity","treatm","normal"]
[621,"SOLNI_eff_obs1","Nattskatta","Natskygge sort","SOLNI","First grading","Efficacy",1,1,14,1,"identity","treatm","normal"]
[622,"SOLTU_eff_obs1","Potatis","Kartoffel","SOLTU","First grading","Efficacy",1,1,14,1,"identity","treatm","normal"]
[623,"SONAR_eff_obs1","Åkermolke","Svinemaelk ager","SONAR","First grading","Efficacy",1,1,14,1,"identity","treatm","normal"]
[624,"SSYOF_eff_obs1","Vägsenap","Rød Tvetand","SSYOF","First grading","Efficacy",1,1,14,1,"identity","treatm","normal"]
[625,"STAPA_eff_obs1","Knölsyska","Kær-Galtetand","STAPA","First grading","Efficacy",1,1,14,1,"identity","treatm","normal"]
[626,"STEME_eff_obs1","Våtarv","Fuglegraes","STEME","First grading","Efficacy",1,1,14,1,"identity","treatm","normal"]
[627,"TAROF_eff_obs1","Maskros","Almindelig Mælkebøtte","TAROF","First grading","Efficacy",1,1,14,1,"identity","treatm","normal"]
[628,"THLAR_eff_obs1","Penningört","Almindelig Pengeurt","THLAR","First grading","Efficacy",1,1,14,1,"identity","treatm","normal"]
[629,"TRZAW_eff_obs1","Spillvete","Hvede (spildkorn)","TRZAW","First grading","Efficacy",1,1,14,1,"identity","treatm","normal"]
[630,"TTTTT_eff_obs1","Ogräs Ospec","Ukrudt uspecificeret","TTTTT","First grading","Efficacy",1,1,14,1,"identity","treatm","normal"]
[631,"TUSFA_eff_obs1","Hästhov","Følfod","TUSFA","First grading","Efficacy",1,1,14,1,"identity","treatm","normal"]
[632,"URTUR_eff_obs1","Etternässla","Liden Naelde","URTUR","First grading","Efficacy",1,1,14,1,"identity","treatm","normal"]
[633,"VERAG_eff_obs1","Åkerveronika","Flerfarvet Ærenpris","VERAG","First grading","Efficacy",1,1,14,1,"identity","treatm","normal"]
[634,"VERAR_eff_obs1","Fältveronika","Aerenpris mark","VERAR","First grading","Efficacy",1,1,14,1,"identity","treatm","normal"]
[635,"VERHE_eff_obs1","Murgrönsveronika","Aerenspris vedbend","VERHE","First grading","Efficacy",1,1,14,1,"identity","treatm","normal"]
[636,"VERPE_eff_obs1","Trädgårdsveronika","Aerenpris storkronet","VERPE","First grading","Efficacy",1,1,14,1,"identity","treatm","normal"]
[637,"VERSS_eff_obs1","Veronika","Stedmoderblomst","VERSS","First grading","Efficacy",1,1,14,1,"identity","treatm","normal"]
[638,"VIOAR_eff_obs1","Åkerviol","Ager-Stedmoderblomst","VIOAR","First grading","Efficacy",1,1,14,1,"identity","treatm","normal"]
[639,"VIOSS_eff_obs1","Viol","Viol","VIOSS","First grading","Efficacy",1,1,14,1,"identity","treatm","normal"]
[640,"AEOPO_eff_obs1_a2","Total marktäckning","Total marktäckning","Total ground cover","Second grading","Efficacy",1,1,14,1,"identity","treatm","normal"]
[641,"AETCY_eff_obs1_a2","Kirskål","Skvalderkål","AEOPO","Second grading","Efficacy",1,1,14,1,"identity","treatm","normal"]
[642,"AGRRE_eff_obs1_a2","Vildpersilja","Hundepersille","AETCY","Second grading","Efficacy",1,1,14,1,"identity","treatm","normal"]
[643,"ALOMY_eff_obs1_a2","Kvickrot","Almindelig Kvik","AGRRE","Second grading","Efficacy",1,1,14,1,"identity","treatm","normal"]
[644,"ANCAR_eff_obs1_a2","Renkavle","Ager-Rævehale","ALOMY","Second grading","Efficacy",1,1,14,1,"identity","treatm","normal"]
[645,"ANGAR_eff_obs1_a2","Fårtunga","Krumhals","ANCAR","Second grading","Efficacy",1,1,14,1,"identity","treatm","normal"]
[646,"APESV_eff_obs1_a2","Rödmire","Arve rød","ANGAR","Second grading","Efficacy",1,1,14,1,"identity","treatm","normal"]
[647,"ATXPA_eff_obs1_a2","Åkerven","Vindaks","APESV","Second grading","Efficacy",1,1,14,1,"identity","treatm","normal"]
[648,"AVEFA_eff_obs1_a2","Vägmålla","Svinemaelde","ATXPA","Second grading","Efficacy",1,1,14,1,"identity","treatm","normal"]
[649,"AVESA_eff_obs1_a2","Flyghavre","Flyve-Havre","AVEFA","Second grading","Efficacy",1,1,14,1,"identity","treatm","normal"]
[650,"BBBAN_eff_obs1_a2","Spillhavre","Havre","AVESA","Second grading","Efficacy",1,1,14,1,"identity","treatm","normal"]
[651,"BRSNN_eff_obs1_a2","Tvåhjbl Arter","Ukrudt tokimbladet","BBBAN","Second grading","Efficacy",1,1,14,1,"identity","treatm","normal"]
[652,"CAPBP_eff_obs1_a2","Spillraps","Raps","BRSNN","Second grading","Efficacy",1,1,14,1,"identity","treatm","normal"]
[653,"CENCY_eff_obs1_a2","Lomme","Hyrdetaske","CAPBP","Second grading","Efficacy",1,1,14,1,"identity","treatm","normal"]
[654,"CHEAL_eff_obs1_a2","Blåklint","Kornblomst","CENCY","Second grading","Efficacy",1,1,14,1,"identity","treatm","normal"]
[655,"CHESS_eff_obs1_a2","Svinmålla","Gaasefod hvidmelet","CHEAL","Second grading","Efficacy",1,1,14,1,"identity","treatm","normal"]
[656,"CIRAR_eff_obs1_a2","Målla","Gåsefod-Arter","CHESS","Second grading","Efficacy",1,1,14,1,"identity","treatm","normal"]
[657,"CONAR_eff_obs1_a2","Åkertistel","Agertidsel","CIRAR","Second grading","Efficacy",1,1,14,1,"identity","treatm","normal"]
[658,"CRDAR_eff_obs1_a2","Åkervinda","Ager-Snerle","CONAR","Second grading","Efficacy",1,1,14,1,"identity","treatm","normal"]
[659,"ECHCG_eff_obs1_a2","Sandtrav","Almindelig Sandkarse","CRDAR","Second grading","Efficacy",1,1,14,1,"identity","treatm","normal"]
[660,"EPHEX_eff_obs1_a2","Hönshirs","Almindelig Hanespore","ECHCG","Second grading","Efficacy",1,1,14,1,"identity","treatm","normal"]
[661,"EPHHE_eff_obs1_a2","Småtörel","Vortemaelk liden","EPHEX","Second grading","Efficacy",1,1,14,1,"identity","treatm","normal"]
[662,"EQUAR_eff_obs1_a2","Revormstörel","Skaerm-Vortemaelk","EPHHE","Second grading","Efficacy",1,1,14,1,"identity","treatm","normal"]
[663,"EROCI_eff_obs1_a2","Åkerfräken","Ager-Padderok","EQUAR","Second grading","Efficacy",1,1,14,1,"identity","treatm","normal"]
[664,"FUMOF_eff_obs1_a2","Skatnäva","Hejrenaeb","EROCI","Second grading","Efficacy",1,1,14,1,"identity","treatm","normal"]
[665,"GAEBI_eff_obs1_a2","Jordrök","Laege-Jordrøg","FUMOF","Second grading","Efficacy",1,1,14,1,"identity","treatm","normal"]
[666,"GAELA_eff_obs1_a2","Toppdån","Skov-Hanekro","GAEBI","Second grading","Efficacy",1,1,14,1,"identity","treatm","normal"]
[667,"GAESP_eff_obs1_a2","Mjukdån","Sand-Hanekro","GAELA","Second grading","Efficacy",1,1,14,1,"identity","treatm","normal"]
[668,"GAESS_eff_obs1_a2","Hampdån","Hamp-Hanekro","GAESP","Second grading","Efficacy",1,1,14,1,"identity","treatm","normal"]
[669,"GAETE_eff_obs1_a2","Dån","Hanekro","GAESS","Second grading","Efficacy",1,1,14,1,"identity","treatm","normal"]
[670,"GALAP_eff_obs1_a2","Pipdån","Almindelig Hanekro","GAETE","Second grading","Efficacy",1,1,14,1,"identity","treatm","normal"]
[671,"GERDI_eff_obs1_a2","Snärjmåra","Burresnerre","GALAP","Second grading","Efficacy",1,1,14,1,"identity","treatm","normal"]
[672,"GERMO_eff_obs1_a2","Fliknäva","Skov-Galtetand Stachys","GERDI","Second grading","Efficacy",1,1,14,1,"identity","treatm","normal"]
[673,"GERPU_eff_obs1_a2","Mjuknäva","Kær-Galtetand Stachys","GERMO","Second grading","Efficacy",1,1,14,1,"identity","treatm","normal"]
[674,"GERRO_eff_obs1_a2","Sparvnäva","Storkenaeb liden","GERPU","Second grading","Efficacy",1,1,14,1,"identity","treatm","normal"]
[675,"GERSS_eff_obs1_a2","Stinknäva","Stinkende Storkenæb","GERRO","Second grading","Efficacy",1,1,14,1,"identity","treatm","normal"]
[676,"GGGAN_eff_obs1_a2","Näva","Storkenæb","GERSS","Second grading","Efficacy",1,1,14,1,"identity","treatm","normal"]
[677,"HORVW_eff_obs1_a2","Gräs, Annuell","Græs","GGGAN","Second grading","Efficacy",1,1,14,1,"identity","treatm","normal"]
[678,"LAMAL_eff_obs1_a2","Spillkorn","Korn spild","HORVW","Second grading","Efficacy",1,1,14,1,"identity","treatm","normal"]
[679,"LAMAM_eff_obs1_a2","Vitplister","Døvnælde","LAMAL","Second grading","Efficacy",1,1,14,1,"identity","treatm","normal"]
[680,"LAMIN_eff_obs1_a2","Mjukplister","Liden Torskemund","LAMAM","Second grading","Efficacy",1,1,14,1,"identity","treatm","normal"]
[681,"LAMPU_eff_obs1_a2","Flikplister","Fliget Tvetand","LAMIN","Second grading","Efficacy",1,1,14,1,"identity","treatm","normal"]
[682,"LAMSS_eff_obs1_a2","Rödplister","Tvetand roed","LAMPU","Second grading","Efficacy",1,1,14,1,"identity","treatm","normal"]
[683,"LAPCO_eff_obs1_a2","Plister","Tvetand andre","LAMSS","Second grading","Efficacy",1,1,14,1,"identity","treatm","normal"]
[684,"LOLMU_eff_obs1_a2","Harkål","Haremad","LAPCO","Second grading","Efficacy",1,1,14,1,"identity","treatm","normal"]
[685,"LOLPE_eff_obs1_a2","Ital Rajgräs","Rajgræs, Italiensk","LOLMU","Second grading","Efficacy",1,1,14,1,"identity","treatm","normal"]
[686,"MATCH_eff_obs1_a2","Eng Rajgräs","Almindelig Rajgraes","LOLPE","Second grading","Efficacy",1,1,14,1,"identity","treatm","normal"]
[687,"MATIN_eff_obs1_a2","Kamomill","Kamille vellugtende","MATCH","Second grading","Efficacy",1,1,14,1,"identity","treatm","normal"]
[688,"MATSU_eff_obs1_a2","Baldersbrå","Kamille lugtloes","MATIN","Second grading","Efficacy",1,1,14,1,"identity","treatm","normal"]
[689,"MYOAR_eff_obs1_a2","Gatkamomill","Kamille skive","MATSU","Second grading","Efficacy",1,1,14,1,"identity","treatm","normal"]
[690,"MYOSS_eff_obs1_a2","Åkerförgätmigej","Forglemmigej mark","MYOAR","Second grading","Efficacy",1,1,14,1,"identity","treatm","normal"]
[691,"PAPRH_eff_obs1_a2","Förgätmigej","Forglemmigej","MYOSS","Second grading","Efficacy",1,1,14,1,"identity","treatm","normal"]
[692,"PAPSS_eff_obs1_a2","Kornvallmo","Valmue Korn","PAPRH","Second grading","Efficacy",1,1,14,1,"identity","treatm","normal"]
[693,"PLALA_eff_obs1_a2","Vallmo","Valmue","PAPSS","Second grading","Efficacy",1,1,14,1,"identity","treatm","normal"]
[694,"PLAMA_eff_obs1_a2","Svartkämpar","Lancet-Vejbred","PLALA","Second grading","Efficacy",1,1,14,1,"identity","treatm","normal"]
[695,"PLAME_eff_obs1_a2","Groblad","Glat Vejbred","PLAMA","Second grading","Efficacy",1,1,14,1,"identity","treatm","normal"]
[696,"POAAN_eff_obs1_a2","Rödkämpar","Dunet Vejbred","PLAME","Second grading","Efficacy",1,1,14,1,"identity","treatm","normal"]
[697,"POLAM_eff_obs1_a2","Vitgröe","Rapgraes enaarig","POAAN","Second grading","Efficacy",1,1,14,1,"identity","treatm","normal"]
[698,"POLAV_eff_obs1_a2","Vattenpilört","Vand-Pileurt","POLAM","Second grading","Efficacy",1,1,14,1,"identity","treatm","normal"]
[699,"POLCO_eff_obs1_a2","Trampört","Pileurt vej","POLAV","Second grading","Efficacy",1,1,14,1,"identity","treatm","normal"]
[700,"POLCO_eff_obs1_a2","Åkerbinda","Snerle-Pileurt","POLCO","Second grading","Efficacy",1,1,14,1,"identity","treatm","normal"]
[701,"POLHY_eff_obs1_a2","åkerbinda","Pileurt snerle","POLCO","Second grading","Efficacy",1,1,14,1,"identity","treatm","normal"]
[702,"POLLA_eff_obs1_a2","Bitterpilört","Bidende Pileurt","POLHY","Second grading","Efficacy",1,1,14,1,"identity","treatm","normal"]
[703,"POLPE_eff_obs1_a2","Vanlig Pilört","Pileurt bleg","POLLA","Second grading","Efficacy",1,1,14,1,"identity","treatm","normal"]
[704,"RAPRA_eff_obs1_a2","Åkerpilört","Pileurt fersken","POLPE","Second grading","Efficacy",1,1,14,1,"identity","treatm","normal"]
[705,"SENVU_eff_obs1_a2","Åkerrättika","Kiddike","RAPRA","Second grading","Efficacy",1,1,14,1,"identity","treatm","normal"]
[706,"SILNO_eff_obs1_a2","Korsört","Brandbaeger almindelig","SENVU","Second grading","Efficacy",1,1,14,1,"identity","treatm","normal"]
[707,"SINAR_eff_obs1_a2","Nattglim","Limurt nat","SILNO","Second grading","Efficacy",1,1,14,1,"identity","treatm","normal"]
[708,"SOLNI_eff_obs1_a2","Åkersenap","Agersennep","SINAR","Second grading","Efficacy",1,1,14,1,"identity","treatm","normal"]
[709,"SOLTU_eff_obs1_a2","Nattskatta","Natskygge sort","SOLNI","Second grading","Efficacy",1,1,14,1,"identity","treatm","normal"]
[710,"SONAR_eff_obs1_a2","Potatis","Kartoffel","SOLTU","Second grading","Efficacy",1,1,14,1,"identity","treatm","normal"]
[711,"SSYOF_eff_obs1_a2","Åkermolke","Svinemaelk ager","SONAR","Second grading","Efficacy",1,1,14,1,"identity","treatm","normal"]
[712,"STAPA_eff_obs1_a2","Vägsenap","Rød Tvetand","SSYOF","Second grading","Efficacy",1,1,14,1,"identity","treatm","normal"]
[713,"STEME_eff_obs1_a2","Knölsyska","Kær-Galtetand","STAPA","Second grading","Efficacy",1,1,14,1,"identity","treatm","normal"]
[714,"TAROF_eff_obs1_a2","Våtarv","Fuglegraes","STEME","Second grading","Efficacy",1,1,14,1,"identity","treatm","normal"]
[715,"THLAR_eff_obs1_a2","Maskros","Almindelig Mælkebøtte","TAROF","Second grading","Efficacy",1,1,14,1,"identity","treatm","normal"]
[716,"TRZAW_eff_obs1_a2","Penningört","Almindelig Pengeurt","THLAR","Second grading","Efficacy",1,1,14,1,"identity","treatm","normal"]
[717,"TTTTT_eff_obs1_a2","Spillvete","Hvede (spildkorn)","TRZAW","Second grading","Efficacy",1,1,14,1,"identity","treatm","normal"]
[718,"TUSFA_eff_obs1_a2","Ogräs Ospec","Ukrudt uspecificeret","TTTTT","Second grading","Efficacy",1,1,14,1,"identity","treatm","normal"]
[719,"URTUR_eff_obs1_a2","Hästhov","Følfod","TUSFA","Second grading","Efficacy",1,1,14,1,"identity","treatm","normal"]
[720,"VERAG_eff_obs1_a2","Etternässla","Liden Naelde","URTUR","Second grading","Efficacy",1,1,14,1,"identity","treatm","normal"]
[721,"VERAR_eff_obs1_a2","Åkerveronika","Flerfarvet Ærenpris","VERAG","Second grading","Efficacy",1,1,14,1,"identity","treatm","normal"]
[722,"VERHE_eff_obs1_a2","Fältveronika","Aerenpris mark","VERAR","Second grading","Efficacy",1,1,14,1,"identity","treatm","normal"]
[723,"VERPE_eff_obs1_a2","Murgrönsveronika","Aerenspris vedbend","VERHE","Second grading","Efficacy",1,1,14,1,"identity","treatm","normal"]
[724,"VERSS_eff_obs1_a2","Trädgårdsveronika","Aerenpris storkronet","VERPE","Second grading","Efficacy",1,1,14,1,"identity","treatm","normal"]
[725,"VIOAR_eff_obs1_a2","Veronika","Stedmoderblomst","VERSS","Second grading","Efficacy",1,1,14,1,"identity","treatm","normal"]
[726,"VIOSS_eff_obs1_a2","Åkerviol","Ager-Stedmoderblomst","VIOAR","Second grading","Efficacy",1,1,14,1,"identity","treatm","normal"]
[727,"VIOSS_proc_obs1_a2","Viol","Viol","VIOSS","Second grading","Efficacy",1,1,14,1,"identity","treatm","normal"]
[728,"AEOPO_above_obs1","Kirskål","Skvalderkål","AEOPO","Above in August","%",1,1,14,1,"identity","treatm","normal"]
[729,"AETCY_above_obs1","Vildpersilja","Hundepersille","AETCY","Above in August","%",1,1,14,1,"identity","treatm","normal"]
[730,"AGRRE_above_obs1","Kvickrot","Almindelig Kvik","AGRRE","Above in August","%",1,1,14,1,"identity","treatm","normal"]
[731,"ALOMY_above_obs1","Renkavle","Ager-Rævehale","ALOMY","Above in August","%",1,1,14,1,"identity","treatm","normal"]
[732,"ANCAR_above_obs1","Fårtunga","Krumhals","ANCAR","Above in August","%",1,1,14,1,"identity","treatm","normal"]
[733,"ANGAR_above_obs1","Rödmire","Arve rød","ANGAR","Above in August","%",1,1,14,1,"identity","treatm","normal"]
[734,"APESV_above_obs1","Åkerven","Vindaks","APESV","Above in August","%",1,1,14,1,"identity","treatm","normal"]
[735,"ATXPA_above_obs1","Vägmålla","Svinemaelde","ATXPA","Above in August","%",1,1,14,1,"identity","treatm","normal"]
[736,"AVEFA_above_obs1","Flyghavre","Flyve-Havre","AVEFA","Above in August","%",1,1,14,1,"identity","treatm","normal"]
[737,"AVESA_above_obs1","Spillhavre","Havre","AVESA","Above in August","%",1,1,14,1,"identity","treatm","normal"]
[738,"BBBAN_above_obs1","Tvåhjbl Arter","Ukrudt tokimbladet","BBBAN","Above in August","%",1,1,14,1,"identity","treatm","normal"]
[739,"BRSNN_above_obs1","Spillraps","Raps","BRSNN","Above in August","%",1,1,14,1,"identity","treatm","normal"]
[740,"CAPBP_above_obs1","Lomme","Hyrdetaske","CAPBP","Above in August","%",1,1,14,1,"identity","treatm","normal"]
[741,"CENCY_above_obs1","Blåklint","Kornblomst","CENCY","Above in August","%",1,1,14,1,"identity","treatm","normal"]
[742,"CHEAL_above_obs1","Svinmålla","Gaasefod hvidmelet","CHEAL","Above in August","%",1,1,14,1,"identity","treatm","normal"]
[743,"CHESS_above_obs1","Målla","Gåsefod-Arter","CHESS","Above in August","%",1,1,14,1,"identity","treatm","normal"]
[744,"CIRAR_above_obs1","Åkertistel","Agertidsel","CIRAR","Above in August","%",1,1,14,1,"identity","treatm","normal"]
[745,"CONAR_above_obs1","Åkervinda","Ager-Snerle","CONAR","Above in August","%",1,1,14,1,"identity","treatm","normal"]
[746,"CRDAR_above_obs1","Sandtrav","Almindelig Sandkarse","CRDAR","Above in August","%",1,1,14,1,"identity","treatm","normal"]
[747,"ECHCG_above_obs1","Hönshirs","Almindelig Hanespore","ECHCG","Above in August","%",1,1,14,1,"identity","treatm","normal"]
[748,"EPHEX_above_obs1","Småtörel","Vortemaelk liden","EPHEX","Above in August","%",1,1,14,1,"identity","treatm","normal"]
[749,"EPHHE_above_obs1","Revormstörel","Skaerm-Vortemaelk","EPHHE","Above in August","%",1,1,14,1,"identity","treatm","normal"]
[750,"EQUAR_above_obs1","Åkerfräken","Ager-Padderok","EQUAR","Above in August","%",1,1,14,1,"identity","treatm","normal"]
[751,"EROCI_above_obs1","Skatnäva","Hejrenaeb","EROCI","Above in August","%",1,1,14,1,"identity","treatm","normal"]
[752,"FUMOF_above_obs1","Jordrök","Laege-Jordrøg","FUMOF","Above in August","%",1,1,14,1,"identity","treatm","normal"]
[753,"GAEBI_above_obs1","Toppdån","Skov-Hanekro","GAEBI","Above in August","%",1,1,14,1,"identity","treatm","normal"]
[754,"GAELA_above_obs1","Mjukdån","Sand-Hanekro","GAELA","Above in August","%",1,1,14,1,"identity","treatm","normal"]
[755,"GAESP_above_obs1","Hampdån","Hamp-Hanekro","GAESP","Above in August","%",1,1,14,1,"identity","treatm","normal"]
[756,"GAESS_above_obs1","Dån","Hanekro","GAESS","Above in August","%",1,1,14,1,"identity","treatm","normal"]
[757,"GAETE_above_obs1","Pipdån","Almindelig Hanekro","GAETE","Above in August","%",1,1,14,1,"identity","treatm","normal"]
[758,"GALAP_above_obs1","Snärjmåra","Burresnerre","GALAP","Above in August","%",1,1,14,1,"identity","treatm","normal"]
[759,"GERDI_above_obs1","Fliknäva","Skov-Galtetand Stachys","GERDI","Above in August","%",1,1,14,1,"identity","treatm","normal"]
[760,"GERMO_above_obs1","Mjuknäva","Kær-Galtetand Stachys","GERMO","Above in August","%",1,1,14,1,"identity","treatm","normal"]
[761,"GERPU_above_obs1","Sparvnäva","Storkenaeb liden","GERPU","Above in August","%",1,1,14,1,"identity","treatm","normal"]
[762,"GERRO_above_obs1","Stinknäva","Stinkende Storkenæb","GERRO","Above in August","%",1,1,14,1,"identity","treatm","normal"]
[763,"GERSS_above_obs1","Näva","Storkenæb","GERSS","Above in August","%",1,1,14,1,"identity","treatm","normal"]
[764,"GGGAN_above_obs1","Gräs, Annuell","Græs","GGGAN","Above in August","%",1,1,14,1,"identity","treatm","normal"]
[765,"HORVW_above_obs1","Spillkorn","Korn spild","HORVW","Above in August","%",1,1,14,1,"identity","treatm","normal"]
[766,"LAMAL_above_obs1","Vitplister","Døvnælde","LAMAL","Above in August","%",1,1,14,1,"identity","treatm","normal"]
[767,"LAMAM_above_obs1","Mjukplister","Liden Torskemund","LAMAM","Above in August","%",1,1,14,1,"identity","treatm","normal"]
[768,"LAMIN_above_obs1","Flikplister","Fliget Tvetand","LAMIN","Above in August","%",1,1,14,1,"identity","treatm","normal"]
[769,"LAMPU_above_obs1","Rödplister","Tvetand roed","LAMPU","Above in August","%",1,1,14,1,"identity","treatm","normal"]
[770,"LAMSS_above_obs1","Plister","Tvetand andre","LAMSS","Above in August","%",1,1,14,1,"identity","treatm","normal"]
[771,"LAPCO_above_obs1","Harkål","Haremad","LAPCO","Above in August","%",1,1,14,1,"identity","treatm","normal"]
[772,"LOLMU_above_obs1","Ital Rajgräs","Rajgræs, Italiensk","LOLMU","Above in August","%",1,1,14,1,"identity","treatm","normal"]
[773,"LOLPE_above_obs1","Eng Rajgräs","Almindelig Rajgraes","LOLPE","Above in August","%",1,1,14,1,"identity","treatm","normal"]
[774,"MATCH_above_obs1","Kamomill","Kamille vellugtende","MATCH","Above in August","%",1,1,14,1,"identity","treatm","normal"]
[775,"MATIN_above_obs1","Baldersbrå","Kamille lugtloes","MATIN","Above in August","%",1,1,14,1,"identity","treatm","normal"]
[776,"MATSU_above_obs1","Gatkamomill","Kamille skive","MATSU","Above in August","%",1,1,14,1,"identity","treatm","normal"]
[777,"MYOAR_above_obs1","Åkerförgätmigej","Forglemmigej mark","MYOAR","Above in August","%",1,1,14,1,"identity","treatm","normal"]
[778,"MYOSS_above_obs1","Förgätmigej","Forglemmigej","MYOSS","Above in August","%",1,1,14,1,"identity","treatm","normal"]
[779,"PAPRH_above_obs1","Kornvallmo","Valmue Korn","PAPRH","Above in August","%",1,1,14,1,"identity","treatm","normal"]
[780,"PAPSS_above_obs1","Vallmo","Valmue","PAPSS","Above in August","%",1,1,14,1,"identity","treatm","normal"]
[781,"PLALA_above_obs1","Svartkämpar","Lancet-Vejbred","PLALA","Above in August","%",1,1,14,1,"identity","treatm","normal"]
[782,"PLAMA_above_obs1","Groblad","Glat Vejbred","PLAMA","Above in August","%",1,1,14,1,"identity","treatm","normal"]
[783,"PLAME_above_obs1","Rödkämpar","Dunet Vejbred","PLAME","Above in August","%",1,1,14,1,"identity","treatm","normal"]
[784,"POAAN_above_obs1","Vitgröe","Rapgraes enaarig","POAAN","Above in August","%",1,1,14,1,"identity","treatm","normal"]
[785,"POLAM_above_obs1","Vattenpilört","Vand-Pileurt","POLAM","Above in August","%",1,1,14,1,"identity","treatm","normal"]
[786,"POLAV_above_obs1","Trampört","Pileurt vej","POLAV","Above in August","%",1,1,14,1,"identity","treatm","normal"]
[787,"POLCO_above_obs1","Åkerbinda","Snerle-Pileurt","POLCO","Above in August","%",1,1,14,1,"identity","treatm","normal"]
[788,"POLCO_above_obs1","åkerbinda","Pileurt snerle","POLCO","Above in August","%",1,1,14,1,"identity","treatm","normal"]
[789,"POLHY_above_obs1","Bitterpilört","Bidende Pileurt","POLHY","Above in August","%",1,1,14,1,"identity","treatm","normal"]
[790,"POLLA_above_obs1","Vanlig Pilört","Pileurt bleg","POLLA","Above in August","%",1,1,14,1,"identity","treatm","normal"]
[791,"POLPE_above_obs1","Åkerpilört","Pileurt fersken","POLPE","Above in August","%",1,1,14,1,"identity","treatm","normal"]
[792,"RAPRA_above_obs1","Åkerrättika","Kiddike","RAPRA","Above in August","%",1,1,14,1,"identity","treatm","normal"]
[793,"SENVU_above_obs1","Korsört","Brandbaeger almindelig","SENVU","Above in August","%",1,1,14,1,"identity","treatm","normal"]
[794,"SILNO_above_obs1","Nattglim","Limurt nat","SILNO","Above in August","%",1,1,14,1,"identity","treatm","normal"]
[795,"SINAR_above_obs1","Åkersenap","Agersennep","SINAR","Above in August","%",1,1,14,1,"identity","treatm","normal"]
[796,"SOLNI_above_obs1","Nattskatta","Natskygge sort","SOLNI","Above in August","%",1,1,14,1,"identity","treatm","normal"]
[797,"SOLTU_above_obs1","Potatis","Kartoffel","SOLTU","Above in August","%",1,1,14,1,"identity","treatm","normal"]
[798,"SONAR_above_obs1","Åkermolke","Svinemaelk ager","SONAR","Above in August","%",1,1,14,1,"identity","treatm","normal"]
[799,"SSYOF_above_obs1","Vägsenap","Rød Tvetand","SSYOF","Above in August","%",1,1,14,1,"identity","treatm","normal"]
[800,"STAPA_above_obs1","Knölsyska","Kær-Galtetand","STAPA","Above in August","%",1,1,14,1,"identity","treatm","normal"]
[801,"STEME_above_obs1","Våtarv","Fuglegraes","STEME","Above in August","%",1,1,14,1,"identity","treatm","normal"]
[802,"TAROF_above_obs1","Maskros","Almindelig Mælkebøtte","TAROF","Above in August","%",1,1,14,1,"identity","treatm","normal"]
[803,"THLAR_above_obs1","Penningört","Almindelig Pengeurt","THLAR","Above in August","%",1,1,14,1,"identity","treatm","normal"]
[804,"TRZAW_above_obs1","Spillvete","Hvede (spildkorn)","TRZAW","Above in August","%",1,1,14,1,"identity","treatm","normal"]
[805,"TTTTT_above_obs1","Ogräs Ospec","Ukrudt uspecificeret","TTTTT","Above in August","%",1,1,14,1,"identity","treatm","normal"]
[806,"TUSFA_above_obs1","Hästhov","Følfod","TUSFA","Above in August","%",1,1,14,1,"identity","treatm","normal"]
[807,"URTUR_above_obs1","Etternässla","Liden Naelde","URTUR","Above in August","%",1,1,14,1,"identity","treatm","normal"]
[808,"VERAG_above_obs1","Åkerveronika","Flerfarvet Ærenpris","VERAG","Above in August","%",1,1,14,1,"identity","treatm","normal"]
[809,"VERAR_above_obs1","Fältveronika","Aerenpris mark","VERAR","Above in August","%",1,1,14,1,"identity","treatm","normal"]
[810,"VERHE_above_obs1","Murgrönsveronika","Aerenspris vedbend","VERHE","Above in August","%",1,1,14,1,"identity","treatm","normal"]
[811,"VERPE_above_obs1","Trädgårdsveronika","Aerenpris storkronet","VERPE","Above in August","%",1,1,14,1,"identity","treatm","normal"]
[812,"VERSS_above_obs1","Veronika","Stedmoderblomst","VERSS","Above in August","%",1,1,14,1,"identity","treatm","normal"]
[813,"VIOAR_above_obs1","Åkerviol","Ager-Stedmoderblomst","VIOAR","Above in August","%",1,1,14,1,"identity","treatm","normal"]
[814,"VIOSS_above_obs1","Viol","Viol","VIOSS","Above in August","%",1,1,14,1,"identity","treatm","normal"]

{"sheet":"Sprut plan Borg + Laxm","index":6,"n_rows":127,"n_cols":16,"rows_kept":127,"cut":false,"hidden":false,"merged":[]}
["536 Program för ogräsbekämpning"]
["temp3",null,null,null,null,"OBS Hela försöket skall sprutas med vatten från Sandbygård"]
["Syfte/aim: ",null,null,null,null,"Gäller Borgeby och Laxman"]
["Framtidens ogräsbekämpning i sockerbetor i Sverige"]
["Future weed strategies in sugar beets in sweden"]
[]
[null,null,null,null,null,null,null,null,null,"Chemical products"]
["Led","Tid T","dag","Goltix SC","Goltix queen","Betanal Power","Betasana CS","Tramat SC","Centium 36 CS","Safari 50 DF","Safari duo active","Conviso One","Tanaris","pH opti","Renol","sort"]
[null,null,null,"l/ha","l/ha","l/ha","l/ha","l/ha","l/ha","g/ha","g/ha","l/ha","l/ha","ml/ha","l/ha"]
[1,"Ubehandlet"]
[null,null,null,null,null,null,null,null,null,null,null,null,null,null,null,"Smart Renja"]
[2,0,"3 Days AS"]
[null,1,"cotyl. 0. day"]
[null,2,"7. day",null,null,null,null,0.25,null,null,null,0.5,null,null,0.5]
[null,3,"14. day"]
[null,4,"21. day",null,null,null,null,0.25,null,null,null,0.5,null,null,0.5]
[null,5,"28. day"]
[null,6,"35. day"]
[null,"Total",null,{"$f":"SUM(D12:D16)","v":0},0,0,0,0.5,0,0,0,1,{"$f":"SUM(M12:M16)","v":0},0,{"$f":"SUM(O12:O16)","v":1}]
[null,null,null,null,null,null,null,null,null,null,null,null,null,null,null,"Smart Renja"]
[{"$f":"A12+1","v":3},0,"3 Days AS"]
[null,1,"cotyl. 0. day"]
[null,2,"7. day",null,null,null,null,null,null,null,null,0.5,0.6,null,0.5]
[null,3,"14. day"]
[null,4,"21. day",null,null,null,null,null,null,null,null,0.5,0.6,null,0.5]
[null,5,"28. day"]
[null,6,"35. day"]
[null,"Total",null,{"$f":"SUM(D21:D25)","v":0},0,0,0,0,0,0,0,1,{"$f":"SUM(M21:M25)","v":1.2},0,{"$f":"SUM(O21:O25)","v":1}]
[null,null,null,null,null,null,null,null,null,null,null,null,null,null,null,"Daphna"]
[{"$f":"A21+1","v":4},0,"3 Days AS"]
[null,1,"cotyl. 0. day",1.25,null,0.6,null,null,null,5,null,null,null,null,0.5]
[null,2,"7. day",1,null,0.6,null,0.14000000000000001,null,20,null,null,null,null,0.5]
[null,3,"14. day",null,null,0.6,null,0.14000000000000001,null,20,null,null,null,null,0.5]
[null,4,"21. day",0.75,null,null,null,0.14000000000000001,null,30,null,null,null,null,0.5]
[null,5,"28. day"]
[null,6,"35. day"]
[null,"Total",null,{"$f":"SUM(D30:D34)","v":3},0,1.7999999999999998,0,0.42000000000000004,0,75,0,0,{"$f":"SUM(M30:M34)","v":0},0,{"$f":"SUM(O30:O34)","v":2}]
[null,null,null,null,null,null,null,null,null,null,null,null,null,null,null,"Daphna"]
[{"$f":"A30+1","v":5},0,"3 Days AS"]
[null,1,"cotyl. 0. day",1.25,null,null,0.6,null,null,5,null,null,null,null,0.5]
[null,2,"7. day",1,null,null,0.6,0.14000000000000001,null,20,null,null,null,null,0.5]
[null,3,"14. day",null,null,null,0.6,0.14000000000000001,null,20,null,null,null,null,0.5]
[null,4,"21. day",0.75,null,null,null,0.14000000000000001,null,30,null,null,null,null,0.5]
[null,5,"28. day"]
[null,6,"35. day"]
[null,"Total",null,{"$f":"SUM(D39:D43)","v":3},0,0,1.7999999999999998,0.42000000000000004,0,75,0,0,{"$f":"SUM(M39:M43)","v":0},0,{"$f":"SUM(O39:O43)","v":2}]
[null,null,null,null,null,null,null,null,null,null,null,null,null,null,null,"Daphna"]
[{"$f":"A39+1","v":6},0,"3 Days AS"]
[null,1,"cotyl. 0. day",1.25,null,null,null,null,null,5,null,null,null,null,0.5]
[null,2,"7. day",1,null,null,null,0.14000000000000001,null,20,null,null,null,null,0.5]
[null,3,"14. day",null,null,null,null,0.14000000000000001,null,20,null,null,null,null,0.5]
[null,4,"21. day",0.75,null,null,null,0.14000000000000001,null,30,null,null,null,null,0.5]
[null,5,"28. day"]
[null,6,"35. day"]
[null,"Total",null,{"$f":"SUM(D48:D52)","v":3},0,0,0,0.42000000000000004,0,75,0,0,{"$f":"SUM(M48:M52)","v":0},0,{"$f":"SUM(O48:O52)","v":2}]
[null,null,null,null,null,null,null,null,null,null,null,null,null,null,null,"Daphna"]
[{"$f":"A48+1","v":7},0,"3 Days AS"]
[null,1,"cotyl. 0. day",1.25,null,null,0.6,null,null,null,null,null,null,null,0.5]
[null,2,"7. day",1,null,null,0.6,0.14000000000000001,7.4999999999999997E-2,null,null,null,null,null,0.5]
[null,3,"14. day",null,null,null,0.6,0.14000000000000001,0.125,null,null,null,null,null,0.5]
[null,4,"21. day",0.75,null,null,null,0.14000000000000001,null,null,null,null,null,null,0.5]
[null,5,"28. day"]
[null,6,"35. day"]
[null,"Total",null,{"$f":"SUM(D57:D61)","v":3},0,0,1.7999999999999998,0.42000000000000004,0.2,0,0,0,{"$f":"SUM(M57:M61)","v":0},0,{"$f":"SUM(O57:O61)","v":2}]
[null,null,null,null,null,null,null,null,null,null,null,null,null,null,null,"Daphna"]
[{"$f":"A57+1","v":8},0,"3 Days AS"]
[null,1,"cotyl. 0. day",1.25,null,null,2,null,null,5,null,null,null,null,0.5]
[null,2,"7. day",1,null,null,2,0.14000000000000001,null,20,null,null,null,null,0.5]
[null,3,"14. day",null,null,null,2,0.14000000000000001,null,20,null,null,null,null,0.5]
[null,4,"21. day",0.75,null,null,null,0.14000000000000001,null,30,null,null,null,null,0.5]
[null,5,"28. day"]
[null,6,"35. day"]
[null,"Total",null,{"$f":"SUM(D66:D70)","v":3},0,0,6,0.42000000000000004,0,75,0,0,{"$f":"SUM(M66:M70)","v":0},0,{"$f":"SUM(O66:O70)","v":2}]
[null,null,null,null,null,null,null,null,null,null,null,null,null,null,null,"Daphna"]
[{"$f":"A66+1","v":9},0,"3 Days AS"]
[null,1,"cotyl. 0. day",1.25,null,null,null,null,null,10,null,null,0.3,null,0.5]
[null,2,"7. day",1,null,null,null,0.14000000000000001,7.4999999999999997E-2,25,null,null,0.6,null,0.5]
[null,3,"14. day",null,null,null,null,0.14000000000000001,0.125,30,null,null,0.6,null,0.5]
[null,4,"21. day",0.75,null,null,null,0.14000000000000001,null,30,null,null,null,null,0.5]
[null,5,"28. day"]
[null,6,"35. day"]
[null,"Total",null,{"$f":"SUM(D75:D79)","v":3},0,0,0,0.42000000000000004,0.2,95,0,0,{"$f":"SUM(M75:M79)","v":1.5},0,{"$f":"SUM(O75:O79)","v":2}]
[null,null,null,null,null,null,null,null,null,null,null,null,null,null,null,"Daphna"]
[{"$f":"A75+1","v":10},0,"3 Days AS"]
[null,1,"cotyl. 0. day",1.25,null,null,0.6,null,null,5,null,null,0.3,null,0.5]
[null,2,"7. day",1,null,null,0.6,0.14000000000000001,null,20,null,null,0.6,null,0.5]
[null,3,"14. day",null,null,null,0.6,0.14000000000000001,null,20,null,null,0.6,null,0.5]
[null,4,"21. day",0.75,null,null,null,0.14000000000000001,null,30,null,null,null,null,0.5]
[null,5,"28. day"]
[null,6,"35. day"]
[null,"Total",null,{"$f":"SUM(D84:D88)","v":3},0,0,1.7999999999999998,0.42000000000000004,0,75,0,0,{"$f":"SUM(M84:M88)","v":1.5},0,{"$f":"SUM(O84:O88)","v":2}]
[null,null,null,null,null,null,null,null,null,null,null,null,null,null,null,"Daphna"]
[{"$f":"A84+1","v":11},0,"3 Days AS"]
[null,1,"cotyl. 0. day",null,1.25,null,null,null,null,5,null,null,null,null,0.5]
[null,2,"7. day",null,1,null,null,0.14000000000000001,null,20,null,null,null,null,0.5]
[null,3,"14. day",null,null,null,null,0.14000000000000001,null,20,null,null,null,null,0.5]
[null,4,"21. day",null,0.75,null,null,0.14000000000000001,null,30,null,null,null,null,0.5]
[null,5,"28. day"]
[null,6,"35. day"]
[null,"Total",null,{"$f":"SUM(D93:D97)","v":0},3,0,0,0.42000000000000004,0,75,0,0,{"$f":"SUM(M93:M97)","v":0},0,{"$f":"SUM(O93:O97)","v":2}]
[null,null,null,null,null,null,null,null,null,null,null,null,null,null,null,"Daphna"]
[{"$f":"A93+1","v":12},0,"3 Days AS"]
[null,1,"cotyl. 0. day",1.25,null,null,0.6,null,null,5,null,null,null,56.07,0.5]
[null,2,"7-10. day",1,null,null,0.6,0.14000000000000001,null,20,null,null,null,56.07,0.5]
[null,3,"17-20. day",null,null,null,0.6,0.14000000000000001,null,20,null,null,null,56.07,0.5]
[null,4,"27-30. day",0.75,null,null,null,0.14000000000000001,null,30,null,null,null,56.07,0.5]
[null,5,"28. day"]
[null,6,"35. day"]
[null,"Total",null,{"$f":"SUM(D102:D106)","v":3},0,0,1.7999999999999998,0.42000000000000004,0,75,0,0,{"$f":"SUM(M102:M106)","v":0},224.28,{"$f":"SUM(O102:O106)","v":2}]
[null,null,null,null,null,null,null,null,null,null,null,null,null,null,null,"Daphna"]
[{"$f":"A102+1","v":13},0,"3 Days AS",null,null,null,null,null,0.2,null,null,null,null,null,0.5]
[null,1,"cotyl. 0. day",1.25,null,null,0.6,null,null,null,null,null,null,null,0.5]
[null,2,"7-10. day",1,null,null,0.6,0.14000000000000001,null,null,null,null,null,null,0.5]
[null,3,"17-20. day",null,null,null,0.6,0.14000000000000001,null,null,null,null,null,null,0.5]
[null,4,"27-30. day",0.75,null,null,null,0.14000000000000001,null,null,null,null,null,null,0.5]
[null,5,"28. day"]
[null,6,"35. day"]
[null,"Total",null,{"$f":"SUM(D111:D115)","v":3},0,0,1.7999999999999998,0.42000000000000004,0.2,0,0,0,{"$f":"SUM(M111:M115)","v":0},0,{"$f":"SUM(O111:O115)","v":2.5}]
[null,null,null,null,null,null,null,null,null,null,null,null,null,null,null,"Daphna"]
[{"$f":"A111+1","v":14},0,"3 Days AS"]
[null,1,"cotyl. 0. day",1.25,null,null,null,null,null,null,null,null,null,null,0.5]
[null,2,"7.  day",1,null,null,null,0.14000000000000001,null,null,140,null,null,null,0.5]
[null,3,"14. day",null,null,null,null,0.14000000000000001,null,null,140,null,null,null,0.5]
[null,4,"21. day",0.75,null,null,null,0.14000000000000001,null,null,210,null,null,null,0.5]
[null,5,"28. day"]
[null,6,"35. day"]
[null,"Total",null,{"$f":"SUM(D120:D124)","v":3},0,0,0,0.42000000000000004,0,0,490,0,{"$f":"SUM(M120:M124)","v":0},0,{"$f":"SUM(O120:O124)","v":2}]

{"sheet":"Sprut plan (övriga)","index":7,"n_rows":127,"n_cols":16,"rows_kept":127,"cut":false,"hidden":false,"merged":[]}
["536 Program för ogräsbekämpning"]
["temp3",null,null,"OBS Försöket på Alnarp, Reslöv och st Uppåkra skall sprutas med vatten från Borgeby"]
["Syfte/aim: "]
["Framtidens ogräsbekämpning i sockerbetor i Sverige"]
["Future weed strategies in sugar beets in sweden"]
[]
[null,null,null,null,null,null,null,null,null,"Chemical products",null,null,null,"Dos till 150L"]
["Led","Tid T","dag","Goltix SC","Goltix queen","Betanal Power","Betasana CS","Tramat SC","Centium 36 CS","Safari 50 DF","Safari duo active","Conviso One","Tanaris","pH opti","Renol","sort"]
[null,null,null,"l/ha","l/ha","l/ha","l/ha","l/ha","l/ha","g/ha","g/ha","l/ha","l/ha","ml/ha","l/ha"]
[1,"Ubehandlet"]
[null,null,null,null,null,null,null,null,null,null,null,null,null,null,null,"Smart Renja"]
[2,0,"3 Days AS"]
[null,1,"cotyl. 0. day"]
[null,2,"7. day",null,null,null,null,0.25,null,null,null,0.5,null,null,0.5]
[null,3,"14. day"]
[null,4,"21. day",null,null,null,null,0.25,null,null,null,0.5,null,null,0.5]
[null,5,"28. day"]
[null,6,"35. day"]
[null,"Total",null,{"$f":"SUM(D12:D16)","v":0},0,0,0,0.5,0,0,0,1,{"$f":"SUM(M12:M16)","v":0},0,{"$f":"SUM(O12:O16)","v":1}]
[null,null,null,null,null,null,null,null,null,null,null,null,null,null,null,"Smart Renja"]
[{"$f":"A12+1","v":3},0,"3 Days AS"]
[null,1,"cotyl. 0. day"]
[null,2,"7. day",null,null,null,null,null,null,null,null,0.5,0.6,null,0.5]
[null,3,"14. day"]
[null,4,"21. day",null,null,null,null,null,null,null,null,0.5,0.6,null,0.5]
[null,5,"28. day"]
[null,6,"35. day"]
[null,"Total",null,{"$f":"SUM(D21:D25)","v":0},0,0,0,0,0,0,0,1,{"$f":"SUM(M21:M25)","v":1.2},0,{"$f":"SUM(O21:O25)","v":1}]
[null,null,null,null,null,null,null,null,null,null,null,null,null,null,null,"Daphna"]
[{"$f":"A21+1","v":4},0,"3 Days AS"]
[null,1,"cotyl. 0. day",1.25,null,0.6,null,null,null,5,null,null,null,null,0.5]
[null,2,"7. day",1,null,0.6,null,0.14000000000000001,null,20,null,null,null,null,0.5]
[null,3,"14. day",null,null,0.6,null,0.14000000000000001,null,20,null,null,null,null,0.5]
[null,4,"21. day",0.75,null,null,null,0.14000000000000001,null,30,null,null,null,null,0.5]
[null,5,"28. day"]
[null,6,"35. day"]
[null,"Total",null,{"$f":"SUM(D30:D34)","v":3},0,1.7999999999999998,0,0.42000000000000004,0,75,0,0,{"$f":"SUM(M30:M34)","v":0},0,{"$f":"SUM(O30:O34)","v":2}]
[null,null,null,null,null,null,null,null,null,null,null,null,null,null,null,"Daphna"]
[{"$f":"A30+1","v":5},0,"3 Days AS"]
[null,1,"cotyl. 0. day",1.25,null,null,0.6,null,null,5,null,null,null,null,0.5]
[null,2,"7. day",1,null,null,0.6,0.14000000000000001,null,20,null,null,null,null,0.5]
[null,3,"14. day",null,null,null,0.6,0.14000000000000001,null,20,null,null,null,null,0.5]
[null,4,"21. day",0.75,null,null,null,0.14000000000000001,null,30,null,null,null,null,0.5]
[null,5,"28. day"]
[null,6,"35. day"]
[null,"Total",null,{"$f":"SUM(D39:D43)","v":3},0,0,1.7999999999999998,0.42000000000000004,0,75,0,0,{"$f":"SUM(M39:M43)","v":0},0,{"$f":"SUM(O39:O43)","v":2}]
[null,null,null,null,null,null,null,null,null,null,null,null,null,null,null,"Daphna"]
[{"$f":"A39+1","v":6},0,"3 Days AS"]
[null,1,"cotyl. 0. day",1.25,null,null,null,null,null,5,null,null,null,null,0.5]
[null,2,"7. day",1,null,null,null,0.14000000000000001,null,20,null,null,null,null,0.5]
[null,3,"14. day",null,null,null,null,0.14000000000000001,null,20,null,null,null,null,0.5]
[null,4,"21. day",0.75,null,null,null,0.14000000000000001,null,30,null,null,null,null,0.5]
[null,5,"28. day"]
[null,6,"35. day"]
[null,"Total",null,{"$f":"SUM(D48:D52)","v":3},0,0,0,0.42000000000000004,0,75,0,0,{"$f":"SUM(M48:M52)","v":0},0,{"$f":"SUM(O48:O52)","v":2}]
[null,null,null,null,null,null,null,null,null,null,null,null,null,null,null,"Daphna"]
[{"$f":"A48+1","v":7},0,"3 Days AS"]
[null,1,"cotyl. 0. day",1.25,null,null,0.6,null,null,null,null,null,null,null,0.5]
[null,2,"7. day",1,null,null,0.6,0.14000000000000001,7.4999999999999997E-2,null,null,null,null,null,0.5]
[null,3,"14. day",null,null,null,0.6,0.14000000000000001,0.125,null,null,null,null,null,0.5]
[null,4,"21. day",0.75,null,null,null,0.14000000000000001,null,null,null,null,null,null,0.5]
[null,5,"28. day"]
[null,6,"35. day"]
[null,"Total",null,{"$f":"SUM(D57:D61)","v":3},0,0,1.7999999999999998,0.42000000000000004,0.2,0,0,0,{"$f":"SUM(M57:M61)","v":0},0,{"$f":"SUM(O57:O61)","v":2}]
[null,null,null,null,null,null,null,null,null,null,null,null,null,null,null,"Daphna"]
[{"$f":"A57+1","v":8},0,"3 Days AS"]
[null,1,"cotyl. 0. day",1.25,null,null,2,null,null,5,null,null,null,null,0.5]
[null,2,"7. day",1,null,null,2,0.14000000000000001,null,20,null,null,null,null,0.5]
[null,3,"14. day",null,null,null,2,0.14000000000000001,null,20,null,null,null,null,0.5]
[null,4,"21. day",0.75,null,null,null,0.14000000000000001,null,30,null,null,null,null,0.5]
[null,5,"28. day"]
[null,6,"35. day"]
[null,"Total",null,{"$f":"SUM(D66:D70)","v":3},0,0,6,0.42000000000000004,0,75,0,0,{"$f":"SUM(M66:M70)","v":0},0,{"$f":"SUM(O66:O70)","v":2}]
[null,null,null,null,null,null,null,null,null,null,null,null,null,null,null,"Daphna"]
[{"$f":"A66+1","v":9},0,"3 Days AS"]
[null,1,"cotyl. 0. day",1.25,null,null,null,null,null,10,null,null,0.3,null,0.5]
[null,2,"7. day",1,null,null,null,0.14000000000000001,7.4999999999999997E-2,25,null,null,0.6,null,0.5]
[null,3,"14. day",null,null,null,null,0.14000000000000001,0.125,30,null,null,0.6,null,0.5]
[null,4,"21. day",0.75,null,null,null,0.14000000000000001,null,30,null,null,null,null,0.5]
[null,5,"28. day"]
[null,6,"35. day"]
[null,"Total",null,{"$f":"SUM(D75:D79)","v":3},0,0,0,0.42000000000000004,0.2,95,0,0,{"$f":"SUM(M75:M79)","v":1.5},0,{"$f":"SUM(O75:O79)","v":2}]
[null,null,null,null,null,null,null,null,null,null,null,null,null,null,null,"Daphna"]
[{"$f":"A75+1","v":10},0,"3 Days AS"]
[null,1,"cotyl. 0. day",1.25,null,null,0.6,null,null,5,null,null,0.3,null,0.5]
[null,2,"7. day",1,null,null,0.6,0.14000000000000001,null,20,null,null,0.6,null,0.5]
[null,3,"14. day",null,null,null,0.6,0.14000000000000001,null,20,null,null,0.6,null,0.5]
[null,4,"21. day",0.75,null,null,null,0.14000000000000001,null,30,null,null,null,null,0.5]
[null,5,"28. day"]
[null,6,"35. day"]
[null,"Total",null,{"$f":"SUM(D84:D88)","v":3},0,0,1.7999999999999998,0.42000000000000004,0,75,0,0,{"$f":"SUM(M84:M88)","v":1.5},0,{"$f":"SUM(O84:O88)","v":2}]
[null,null,null,null,null,null,null,null,null,null,null,null,null,null,null,"Daphna"]
[{"$f":"A84+1","v":11},0,"3 Days AS"]
[null,1,"cotyl. 0. day",null,1.25,null,null,null,null,5,null,null,null,null,0.5]
[null,2,"7. day",null,1,null,null,0.14000000000000001,null,20,null,null,null,null,0.5]
[null,3,"14. day",null,null,null,null,0.14000000000000001,null,20,null,null,null,null,0.5]
[null,4,"21. day",null,0.75,null,null,0.14000000000000001,null,30,null,null,null,null,0.5]
[null,5,"28. day"]
[null,6,"35. day"]
[null,"Total",null,{"$f":"SUM(D93:D97)","v":0},3,0,0,0.42000000000000004,0,75,0,0,{"$f":"SUM(M93:M97)","v":0},0,{"$f":"SUM(O93:O97)","v":2}]
[null,null,null,null,null,null,null,null,null,null,null,null,null,null,null,"Daphna"]
[{"$f":"A93+1","v":12},0,"3 Days AS"]
[null,1,"cotyl. 0. day",1.25,null,null,0.6,null,null,5,null,null,null,16,0.5]
[null,2,"7-10. day",1,null,null,0.6,0.14000000000000001,null,20,null,null,null,16,0.5]
[null,3,"17-20. day",null,null,null,0.6,0.14000000000000001,null,20,null,null,null,16,0.5]
[null,4,"27-30. day",0.75,null,null,null,0.14000000000000001,null,30,null,null,null,16,0.5]
[null,5,"28. day"]
[null,6,"35. day"]
[null,"Total",null,{"$f":"SUM(D102:D106)","v":3},0,0,1.7999999999999998,0.42000000000000004,0,75,0,0,{"$f":"SUM(M102:M106)","v":0},64,{"$f":"SUM(O102:O106)","v":2}]
[null,null,null,null,null,null,null,null,null,null,null,null,null,null,null,"Daphna"]
[{"$f":"A102+1","v":13},0,"3 Days AS",null,null,null,null,null,0.2,null,null,null,null,null,0.5]
[null,1,"cotyl. 0. day",1.25,null,null,0.6,null,null,null,null,null,null,null,0.5]
[null,2,"7-10. day",1,null,null,0.6,0.14000000000000001,null,null,null,null,null,null,0.5]
[null,3,"17-20. day",null,null,null,0.6,0.14000000000000001,null,null,null,null,null,null,0.5]
[null,4,"27-30. day",0.75,null,null,null,0.14000000000000001,null,null,null,null,null,null,0.5]
[null,5,"28. day"]
[null,6,"35. day"]
[null,"Total",null,{"$f":"SUM(D111:D115)","v":3},0,0,1.7999999999999998,0.42000000000000004,0.2,0,0,0,{"$f":"SUM(M111:M115)","v":0},0,{"$f":"SUM(O111:O115)","v":2.5}]
[null,null,null,null,null,null,null,null,null,null,null,null,null,null,null,"Daphna"]
[{"$f":"A111+1","v":14},0,"3 Days AS"]
[null,1,"cotyl. 0. day",1.25,null,null,null,null,null,null,null,null,null,null,0.5]
[null,2,"7.  day",1,null,null,null,0.14000000000000001,null,null,140,null,null,null,0.5]
[null,3,"14. day",null,null,null,null,0.14000000000000001,null,null,140,null,null,null,0.5]
[null,4,"21. day",0.75,null,null,null,0.14000000000000001,null,null,210,null,null,null,0.5]
[null,5,"28. day"]
[null,6,"35. day"]
[null,"Total",null,{"$f":"SUM(D120:D124)","v":3},0,0,0,0.42000000000000004,0,0,490,0,{"$f":"SUM(M120:M124)","v":0},0,{"$f":"SUM(O120:O124)","v":2}]

{"sheet":"4 försök","index":8,"n_rows":25,"n_cols":1000,"rows_kept":25,"cut":false,"hidden":false,"merged":[]}
[1,2,3,4,10,15,16,17,18,31,35,36,164,165,166,160,161,170,172,173,175,180,181,182,183,185,188,216,219,228,235,265,285,290,303,306,316,322,323,339,343,350,352,354,357,360,369,372,377,739,742,752,775,779,788,793,796,null,null,null,null,null,null,null,null,null,null,null,null,null,null,null,null,null,null,null,null,null,null,null,null,null,null,null,null,null,null,null,null,null,null,null,null,null,null,null,null,null,null,null,null,null,null,null,null,null,null,null,null,null,null,null,null,null,null,null,null,null,null,null,null,null,null,null,null,null,null,null,null,null,null,null,null,null,null,null,null,null,null,null,null,null,null,null,null,null,null,null,null,null,null,null,null,null,null,null,null,null,null,null,null,null,null,null,null,null,null,null,null,null,null,null,null,null,null,null,null,null,null,null,null,null,null,null,null,null,null,null,null,null,null,null,null,null,null,null,null,null,null,null,null,null,null,null,null,null,null,null,null,null,null,null,null,null,null,null,null,null,null,null,null,null,null,null,null,null,null,null,null,null,null,null,null,null,null,null,null,null,null,null,null,null,null,null,null,null,null,null,null,null,null,null,null,null,null,null,null,null,null,null,null,null,null,null,null,null,null,null,null,null,null,null,null,null,null,null,null,null,null,null,null,null,null,null,null,null,null,null,null,null,null,null,null,null,null,null,null,null,null,null,null,null,null,null,null,null,null,null,null,null,null,null,null,null,null,null,null,null,null,null,null,null,null,null,null,null,null,null,null,null,null,null,null,null,null,null,null,null,null,null,null,null,null,null,null,null,null,null,null,null,null,null,null,null,null,null,null,null,null,null,null,null,null,null,null,null,null,null,null,null,null,null,null,null,null,null,null,null,null,null,null,null,null,null,null,null,null,null,null,null,null,null,null,null,null,null,null,null,null,null,null,null,null,null,null,null,null,null,null,null,null,null,null,null,null,null,null,null,null,null,null,null,null,null,null,null,null,null,null,null,null,null,null,null,null,null,null,null,null,null,null,null,null,null,null,null,null,null,null,null,null,null,null,null,null,null,null,null,null,null,null,null,null,null,null,null,null,null,null,null,null,null,null,null,null,null,null,null,null,null,null,null,null,null,null,null,null,null,null,null,null,null,null,null,null,null,null,null,null,null,null,null,null,null,null,null,null,null,null,null,null,null,null,null,null,null,null,null,null,null,null,null,null,null,null,null,null,null,null,null,null,null,null,null,null,null,null,null,null,null,null,null,null,null,null,null,null,null,null,null,null,null,null,null,null,null,null,null,null,null,null,null,null,null,null,null,null,null,null,null,null,null,null,null,null,null,null,null,null,null,null,null,null,null,null,null,null,null,null,null,null,null,null,null,null,null,null,null,null,null,null,null,null,null,null,null,null,null,null,null,null,null,null,null,null,null,null,null,null,null,null,null,null,null,null,null,null,null,null,null,null,null,null,null,null,null,null,null,null,null,null,null,null,null,null,null,null,null,null,null,null,null,null,null,null,null,null,null,null,null,null,null,null,null,null,null,null,null,null,null,null,null,null,null,null,null,null,null,null,null,null,null,null,null,null,null,null,null,null,null,null,null,null,null,null,null,null,null,null,null,null,null,null,null,null,null,null,null,null,null,null,null,null,null,null,null,null,null,null,null,null,null,null,null,null,null,null,null,null,null,null,null,null,null,null,null,null,null,null,null,null,null,null,null,null,null,null,null,null,null,null,null,null,null,null,null,null,null,null,null,null,null,null,null,null,null,null,null,null,null,null,null,null,null,null,null,null,null,null,null,null,null,null,null,null,null,null,null,null,null,null,null,null,null,null,null,null,null,null,null,null,null,null,null,null,null,null,null,null,null,null,null,null,null,null,null,null,null,null,null,null,null,null,null,null,null,null,null,null,null,null,null,null,null,null,null,null,null,null,null,null,null,null,null,null,null,null,null,null,null,null,null,null,null,null,null,null,null,null,null,null,null,null,null,null,null,null,null,null,null,null,null,null,null,null,null,null,null,null,null,null,null,null,null,null,null,null,null,null,null,null,null,null,null,null,null,null,null,null,null,null,null,null,null,null,null,null,null,null,null,null,null,null,null,null,null,null,null,null,null,null,null,null,null,null,null,null,null,null,null,null,null,null,null,null,null,null,null,null,null,null,null,null,null,null,null,null,null,null,null,null,null,null,null,null,null,null,null,null,null,null,null,null,null,null,null,null,null,null,null,null,null,null,null,null,null,null,null,null,null,null,null,null,null,null,null,null,null,null,null,null,null,null,null,null,null,null,null,null,1]
[null,null,null,null,"exl borg","exl borg","exl borg","exl borg","exl borg","exl borg","exl borg","exl borg","exl borg","exl borg","exl borg","exl borg","exl borg","exl borg","exl borg","exl borg","exl borg","exl borg","exl borg","exl borg","exl borg","exl borg","exl borg","exl borg","exl borg","exl borg","exl borg","exl borg","exl borg","exl borg","exl borg","exl borg","exl borg","exl borg","exl borg","exl borg","exl borg","exl borg","exl borg","exl borg","exl borg","exl borg","exl borg","exl borg","exl borg","exl borg","exl borg","exl borg","exl borg","exl borg","exl borg","exl borg","exl borg"]
["Series 536 (exl. borg)",null,null,null,"Plant nr","Rot","Socker","Socker","Socker","Renhet","K+Na","Blåtal","Marktäckning ogräs","Marktäckning ogräs","Marktäckning ogräs","Generell fytotox ","Generell fytotox ","Biomassareduktion","Vitfärgning","Kloros","Missbildade blad ","Biomassareduktion","Eftersatt höjdtillväxt ","Vitfärgning","Kloros","Missbildade blad ","Försenad tillväxt ","Spillraps","Svinmålla","Skatnäva","Snärjmåra","Åkerbinda","Åkerveronika","Åkerviol","Spillraps","Svinmålla","Jordrök","Snärjmåra","Fliknäva","Baldersbrå","Kornvallmo","Trampört","Åkerbinda","Vanlig Pilört","Korsört","Nattskatta","Ogräs Ospec","Åkerveronika","Åkerviol","Spillraps","Svinmålla","Jordrök","Baldersbrå","Kornvallmo","Åkerbinda","Korsört","Nattskatta"]
["4 försök",null,null,null,"Plant no","Root ","Sugar","Sugar","Sugar","Cleaness","K+Na","Amino-N","Ground cover","Ground cover","Ground cover","gen_phy","gen_phy","vor_phy","ble_phy","chl_phy","def_phy","vor_phy","stu_phy","ble_phy","chl_phy","def_phy","phy_del","BRSNN","CHEAL","EROCI","GALAP","POLCO","VERAG","VIOAR","BRSNN","CHEAL","FUMOF","GALAP","GERDI","MATIN","PAPRH","POLAV","POLCO","POLLA","SENVU","SOLNI","TTTTT","VERAG","VIOAR","BRSNN","CHEAL","FUMOF","MATIN","PAPRH","POLCO","SENVU","SOLNI"]
["Expl.",null,null,null,"Final ",null,null,null,null,null,"pr 100g beet","pr 100g beet","First grading","Below, Aug","Above foliage","First grading","Second grading","First grading","First grading","First grading","First grading","Second grading","Second grading","Second grading","Second grading","Second grading","Second grading","First grading","First grading","First grading","First grading","First grading","First grading","First grading","Second grading","Second grading","Second grading","Second grading","Second grading","Second grading","Second grading","Second grading","Second grading","Second grading","Second grading","Second grading","Second grading","Second grading","Second grading","Above in August","Above in August","Above in August","Above in August","Above in August","Above in August","Above in August","Above in August"]
["no trials"]
["Unit",null,null,null,"1000/ha","t/ha","%","t/ha","relative","%","mmol","mg ","% ","% ","% in Aug ","1-30","1-30","%","%","%","%","%","%","%","%","%","%","% ","% ","% ","% ","% ","% ","% ","% ","% ","% ","% ","% ","% ","% ","% ","% ","% ","% ","% ","% ","% ","% ","%","%","%","%","%","%","%","%"]
[null,null,"Strategi","Variety",106.44499999999999,73.477000000000004,17.465,12.843,100,80.046999999999997,3.63,16.166,0.90300000000000002,0.42499999999999999,0.38100000000000001,6.375,0.93700000000000006,7.1879999999999997,0,0.313,0,0.625,0.312,0.312,0,0,0,7.0000000000000001E-3,0.40100000000000002,9.1999999999999998E-2,2.1999999999999999E-2,1E-3,0.58299999999999996,4.1000000000000002E-2,3.2000000000000001E-2,7.1999999999999995E-2,0,1.6E-2,8.5999999999999993E-2,0,0,0,4.7E-2,0,0,5.7000000000000002E-2,0,9.7000000000000003E-2,2.3E-2,0,0.34799999999999998,0,0,0,0,0,0]
[1,null,"Obehandlat","Daphna ",101.64400000000001,"","","",null,"",null,null,36.055999999999997,35.204999999999998,23.940999999999999,0.625,0,0.625,0,0.313,0,0,0,0,0,0,0,1.839,11.292999999999999,1.5760000000000001,1.3360000000000001,4.0190000000000001,8.3699999999999992,7.0970000000000004,3.7149999999999999,5.742,0,0.61599999999999999,1.246,0.6,0.69699999999999995,0.498,6.95,6.6666666666666666E-2,0.28333333333333333,7.8869999999999996,1,0.438,5.4669999999999996,2.08,19.195,0,4.0000000000000008E-2,0.53100000000000003,0,0.24666666666666667,1.8133333333333332]
[2,"R","Conviso smart","Renja KWS",106.44499999999999,73.477000000000004,17.465,12.843,100,80.046999999999997,3.63,16.166,0.90300000000000002,0.42499999999999999,0.38100000000000001,6.375,0.93700000000000006,7.1879999999999997,0,0.313,0,0.625,0.312,0.312,0,0,0,7.0000000000000001E-3,0.40100000000000002,9.1999999999999998E-2,2.1999999999999999E-2,1E-3,0.58299999999999996,4.1000000000000002E-2,3.2000000000000001E-2,7.1999999999999995E-2,0,1.6E-2,8.5999999999999993E-2,0,-3.0000000000000001E-3,-2E-3,4.7E-2,0,0,5.7000000000000002E-2,0,9.7000000000000003E-2,2.3E-2,0,0.34799999999999998,0,0,-2E-3,0,0,0]
[3,null,"Conviso smart förstärkt med Tanaris","Renja KWS",110.026,"","","",null,"",null,null,0.66300000000000003,0.432,0.874,5.9370000000000003,0,5.9379999999999997,0,0,0,0,0,0,0,0,0,1.0999999999999999E-2,0.52,6.6000000000000003E-2,5.3999999999999999E-2,6.5000000000000002E-2,0.17599999999999999,3.1E-2,3.7999999999999999E-2,9.8000000000000004E-2,0,1.6E-2,5.0999999999999997E-2,0,-3.0000000000000001E-3,-2E-3,0.08,0,2.6666666666666668E-2,2.1000000000000001E-2,0,0.09,1.7000000000000001E-2,0,0.84199999999999997,0,0,-2E-3,0,0,0]
[4,null,"Betanal Power","Daphna ",102.86499999999999,91.254999999999995,16.11,14.696,114.42809312465934,87.016000000000005,3.9159999999999999,15.787000000000001,1.296,1.319,1.248,11.875,1.875,11.25,0,2.5,0.125,1.5629999999999999,0,0,0,0,0,0.03,0.85699999999999998,7.1999999999999995E-2,0.1,0.36099999999999999,4.1000000000000002E-2,0.221,0.152,0.26200000000000001,0,2.5999999999999999E-2,8.5999999999999993E-2,0,-3.0000000000000001E-3,1.9E-2,0.33900000000000002,0.01,0,0.13400000000000001,0,5.0000000000000001E-3,0.28899999999999998,0,1.2150000000000001,0,0,-2E-3,0,0,0]
[5,null,"Utan Desmedifam","Daphna ",105.143,90.206000000000003,16.306000000000001,14.712999999999999,114.56046095149108,87.51,4.0069999999999997,15.233000000000001,1.496,2.2789999999999999,1.288,8.75,1.875,8.75,0.188,5.3129999999999997,0.187,0.313,0.312,0.93700000000000006,0,0.313,0.313,4.5999999999999999E-2,1.1839999999999999,8.2000000000000003E-2,5.8999999999999997E-2,0.17100000000000001,7.0000000000000007E-2,0.34899999999999998,0.27400000000000002,0.44700000000000001,0,5.6000000000000001E-2,0.26600000000000001,0,8.0000000000000002E-3,4.4999999999999998E-2,0.69299999999999995,0,0,0.10100000000000001,0,5.0000000000000001E-3,0.38500000000000001,0,1.2549999999999999,0,0,-2E-3,0,0,0]
[6,null,"Utan Desmedifam och Fenmedifam","Daphna ",104.736,90.619,16.132999999999999,14.621,113.84411741804874,87.227999999999994,3.8370000000000002,15.766,3.8359999999999999,3.052,1.321,10.311999999999999,1.25,9.0630000000000006,0,2.8130000000000002,6.2E-2,0.313,0.312,0,0.3125,0.313,0,2.7E-2,1.147,4.2000000000000003E-2,6.7000000000000004E-2,1.0429999999999999,0.19,1.401,0.26200000000000001,0.47699999999999998,0,9.6000000000000002E-2,6.6000000000000003E-2,0,3.6999999999999998E-2,2.8000000000000001E-2,1.3380000000000001,0,1.0000000000000002E-2,0.183,0,4.4999999999999998E-2,0.51100000000000001,0,1.262,0,0,2.4E-2,0,0,0]
[7,null,"Utan Desmedifam stärkt med Centium","Daphna ",103.434,92.025000000000006,16.141999999999999,14.863,115.7284123647123,87.152000000000001,3.8450000000000002,15.965999999999999,1.8360000000000001,1.645,1.321,13.75,4.0620000000000003,10.938000000000001,5.125,0.313,6.2E-2,0,0.312,3.4380000000000002,0.3125,0,1.25,0.111,1.3129999999999999,0.112,3.3000000000000002E-2,0.216,8.3000000000000004E-2,0.56599999999999995,0.40699999999999997,0.29399999999999998,0,1.6E-2,0.16600000000000001,0,5.0000000000000001E-3,1.0999999999999999E-2,0.32500000000000001,0.02,0,0.11899999999999999,0,5.0000000000000001E-3,0.27700000000000002,0,1.262,0,0,-2E-3,0,0,0]
[8,null,"Hög dos Fenmedifam","Daphna ",106.038,90.54,16.126000000000001,14.603999999999999,113.711749591217,87.114000000000004,3.9740000000000002,15.632999999999999,1.3360000000000001,1.252,1.121,10.625,1.25,10.625,0.375,5.5,0.437,0.625,0,0,0.3125,0,0.625,4.8000000000000001E-2,0.98599999999999999,7.1999999999999995E-2,4.4999999999999998E-2,0.23200000000000001,3.3000000000000002E-2,0.23799999999999999,0.13900000000000001,0.26500000000000001,0,1.6E-2,8.5999999999999993E-2,0,1.2999999999999999E-2,1.7999999999999999E-2,0.39700000000000002,0,0,0.122,0,5.0000000000000001E-3,0.192,0,1.052,0,0,2.4E-2,0,0,0.01]
[9,null,"Utan Desmedifam + Fenmedifam stärkt med allt","Daphna ",104.899,"","","",null,"",null,null,2.3359999999999999,1.4850000000000001,0.78800000000000003,12.5,4.375,11.25,2.3130000000000002,0.93799999999999994,0.25,0.313,0.625,2.8119999999999998,0,1.875,0.93799999999999994,4.7E-2,1.5289999999999999,8.2000000000000003E-2,1.9E-2,0.33700000000000002,3.0000000000000001E-3,0.63200000000000001,0.17399999999999999,0.22600000000000001,0,1.6E-2,9.6000000000000002E-2,0,-3.0000000000000001E-3,3.0000000000000001E-3,0.55700000000000005,0,0,0.121,0,5.0000000000000001E-3,0.23799999999999999,0,0.755,0,0,-2E-3,0,0,0]
[10,null,"Tanaris","Daphna ",104.411,"","","",null,"",null,null,2.0230000000000001,2.0190000000000001,1.748,10.625,2.8119999999999998,10.313000000000001,0.188,3,0.56200000000000006,0.313,0.312,0.312,0,0.313,1.25,1.2999999999999999E-2,1.5389999999999999,0.222,6.9000000000000006E-2,0.27100000000000002,1.2999999999999999E-2,0.60799999999999998,0.12,0.46200000000000002,0,1.6E-2,0.28599999999999998,0,-3.0000000000000001E-3,1.4E-2,0.64600000000000002,0,0,0.20100000000000001,0,5.0000000000000001E-3,0.27300000000000002,0,1.7150000000000001,0,0,-2E-3,0,0,0]
[11,null,"Goltix Queen (jämförs mot led 6)","Daphna ",107.015,89.227000000000004,16.164999999999999,14.420999999999999,112.28684886708713,86.951999999999998,3.863,14.965999999999999,5.21,2.8919999999999999,1.534,10.311999999999999,0.93700000000000006,9.0630000000000006,0.313,3.9380000000000002,0.125,0,0.312,0,0,0.313,0.313,4.9000000000000002E-2,2.532,0.10100000000000001,6.0999999999999999E-2,1.5189999999999999,0.105,1.6739999999999999,0.21199999999999999,0.53,0,0.156,0.126,0,2.4E-2,9.8000000000000004E-2,1.01,0,0,0.20200000000000001,0,2.5000000000000001E-2,0.51,0,1.502,0,0,-2E-3,0,0,0]
[12,null,"pH-Opti","Daphna ",103.35299999999999,"","","",null,"",null,null,2.8029999999999999,3.472,2.2810000000000001,11.561999999999999,2.5,10.938000000000001,0,4.6879999999999997,0.125,0.93799999999999994,0.312,0.625,0,0.313,0.93799999999999994,4.3999999999999997E-2,2.339,0.30199999999999999,7.3999999999999996E-2,0.26800000000000002,5.2999999999999999E-2,0.92500000000000004,0.158,0.65400000000000003,0,0.17599999999999999,0.79200000000000004,0,1.2E-2,3.3000000000000002E-2,0.872,0,0,0.33400000000000002,0,5.0000000000000001E-3,0.435,0,2.2080000000000002,0,0,1.0999999999999999E-2,0,0,0]
[13,null,"Centium innan uppkomst","Daphna ",106.20099999999999,"","","",null,"",null,null,2.3359999999999999,2.3319999999999999,1.268,9.6869999999999994,0.93700000000000006,9.6880000000000006,2.1880000000000002,0,6.2E-2,0,0.312,0,0,0,0.625,0.13200000000000001,1.637,0.14199999999999999,0.10100000000000001,0.34699999999999998,0.108,0.44900000000000001,0.50700000000000001,0.52700000000000002,0,1.6E-2,0.16600000000000001,0,0.01,1.9E-2,0.57199999999999995,0.01,0,0.19600000000000001,0,5.0000000000000001E-3,0.30499999999999999,0,1.2350000000000001,0,0,-2E-3,0,0,0]
[14,null,"Safari Duo","Daphna ",108.236,92.03,16.268000000000001,14.967000000000001,116.53819201121235,87.188999999999993,3.8839999999999999,16.832999999999998,2.5760000000000001,1.972,0.93400000000000005,10.311999999999999,0.93700000000000006,9.375,6.3E-2,3.875,6.2E-2,0,0,0,0,0.313,0.313,1.2999999999999999E-2,1.351,0.21199999999999999,5.5E-2,0.61699999999999999,0.18,0.91400000000000003,0.122,0.28799999999999998,0,1.6E-2,0.186,0,1.2999999999999999E-2,8.9999999999999993E-3,0.70299999999999996,0,0,0.20100000000000001,0,3.5000000000000003E-2,0.40100000000000002,0,0.875,0,0,2.4E-2,0,0,0]
["LSD",null,null,null,3.9119999999999999,3.1030000000000002,0.246,0.53,null,0.96,0.18099999999999999,"ns",4.83,3.508,4.3310000000000004,1.925,1.841,1.87,0.80800000000000005,1.8859999999999999,0.30399999999999999,"ns","ns",1.6020000000000001,null,0.75700000000000001,"ns",0.33800000000000002,2.8140000000000001,0.623,0.36099999999999999,1.079,2.2690000000000001,1.845,0.625,0.81100000000000005,null,"ns","ns",null,0.23400000000000001,0.156,1.032,null,null,2.1909999999999998,null,0.17399999999999999,0.90400000000000003,null,3.65,null,null,0.16700000000000001]
["CV",null,null,null,5.5640000000000001,5.0910000000000002,2.202,5.3280000000000003,null,1.63,6.8419999999999996,15.302,156.79400000000001,125.113,248.565,30.295999999999999,162.53899999999999,31.38,157.60499999999999,118.072,308.91899999999998,409.34100000000001,406.14800000000002,398.14400000000001,198.71381302561605,423.09399999999999,340.863,296.666,230.58600000000001,488.79199999999997,401.61399999999998,218.20699999999999,462.14,254.4,216.18299999999999,168.75200000000001,null,649.73400000000004,496.07499999999999,374.16573867739413,561.76800000000003,386.35700000000003,148.94,236.80312741567869,329.57922053254151,463.68200000000002,374.16573867739419,502.58300000000003,201.946,374.16573867739413,242.93799999999999,null,374.16573867739419,540.57399999999996,null,374.16573867739413,371.96141497250244]
["P_value",null,null,null,"<0.05","<0,0001","<0,0001","<0,0001",null,"<0,0001","<0.05",0.54271404593367767,"<0,0001","<0,0001","<0,0001","<0,0001","<0,0001","<0,0001","<0,0001","<0,0001","<0.05",9.9359278764267756E-2,0.75195549164450259,"<0,0001",null,"<0.001",0.16665841190694675,"<0,0001","<0,0001","<0.001","<0,0001","<0,0001","<0,0001","<0,0001","<0,0001","<0,0001",null,6.2520030942131988E-2,0.13362194567115548,null,"<0,0001","<0,0001","<0,0001",null,null,"<0,0001",null,"<0.001","<0,0001",null,"<0,0001",null,null,"<0,0001"]

{"sheet":"Borg 101","index":9,"n_rows":25,"n_cols":30,"rows_kept":25,"cut":false,"hidden":false,"merged":[]}
[1,2,3,4,10,160,161,164,165,166,170,172,173,181,182,185,188,216,219,290,303,306,316,339,350,372,377,739,742,775]
[null,null,null,null,101,101,101,101,101,101,101,101,101,101,101,101,101,101,101,101,101,101,101,101,101,101,101,101,101,101]
["Series 536 (trial no 101)",null,null,null,"Plant nr","Generell fytotox ","Generell fytotox ","Marktäckning ogräs","Marktäckning ogräs","Marktäckning ogräs","Biomassareduktion","Vitfärgning","Kloros","Eftersatt höjdtillväxt ","Vitfärgning","Missbildade blad ","Försenad tillväxt ","Spillraps","Svinmålla","Åkerviol","Spillraps","Svinmålla","Jordrök","Baldersbrå","Trampört","Åkerveronika","Åkerviol","Spillraps","Svinmålla","Baldersbrå"]
["Borgeby",null,null,null,"Plant no","gen_phy","gen_phy","Ground cover","Ground cover","Ground cover","vor_phy","ble_phy","chl_phy","stu_phy","ble_phy","def_phy","phy_del","BRSNN","CHEAL","VIOAR","BRSNN","CHEAL","FUMOF","MATIN","POLAV","VERAG","VIOAR","BRSNN","CHEAL","MATIN"]
["Expl.",null,null,null,"Final ","First grading","Second grading","First grading","Below, Aug","Above foliage","First grading","First grading","First grading","Second grading","Second grading","Second grading","Second grading","First grading","First grading","First grading","Second grading","Second grading","Second grading","Second grading","Second grading","Second grading","Second grading","Above in August","Above in August","Above in August"]
["no trials"]
["Unit",null,null,null,"1000/ha","1-30","1-30","% ","% ","% in Aug ","%","%","%","%","%","%","%","% ","% ","% ","% ","% ","% ","% ","% ","% ","% ","%","%","%"]
[null,null,null,null,109.375,5,0,0.05,2.5000000000000001E-2,0,5,0,0,0,0,0,0,0,0,0,0,0,0,0,0,2.5000000000000001E-2,0,0,0,0]
[1,null,"Obehandlat","Daphna ",106.44499999999999,0,0,4.5,23,4.0750000000000002,0,0,0,0,0,0,0,0.82499999999999996,1.875,1.65,4.4749999999999996,3.4249999999999998,1.425,2.7250000000000001,4.5999999999999996,1.125,5.2249999999999996,0.59,3.2269999999999999,0.22]
[2,"R","Conviso smart","Renja KWS",109.375,5,0,0.05,2.5000000000000001E-2,0,5,0,0,0,0,0,0,0,0,0,0,0,0,0,0,2.5000000000000001E-2,0,0,0,0]
[3,null,"Conviso smart förstärkt med Tanaris","Renja KWS",111.328,5,1.25,0.1,2.5000000000000001E-2,0,5,0,0,1.25,0,0,0,0,0,0.05,0,0,0,0,0,2.5000000000000001E-2,0,0,0,0]
[4,null,"Betanal Power","Daphna ",109.375,13.75,2.5,0.2,0.4,0.3,12.5,0.25,5,2.5,0,0,2.5,0.01,0.09,0.1,0.02,0.1,0.01,0.02,0,0,0.25,0,0.3,0]
[5,null,"Utan Desmedifam","Daphna ",115.23399999999999,10,2.5,0.25,0.375,2.5000000000000001E-2,8.75,0,8.75,0,0,1.25,1.25,0,2.5000000000000001E-2,0.22500000000000001,2.5000000000000001E-2,3.7999999999999999E-2,2.5000000000000001E-2,0,0.05,0,0.23799999999999999,0,2.5000000000000001E-2,0]
[6,null,"Utan Desmedifam och Fenmedifam","Daphna ",104.818,10,3.75,0.2,0.4,7.4999999999999997E-2,10,0,6.25,2.5,0,1.25,2.5,0,0.01,0.19,0.09,0.04,0.04,0,7.0000000000000007E-2,0,0.16,0,7.4999999999999997E-2,0]
[7,null,"Utan Desmedifam stärkt med Centium","Daphna ",96.68,12.5,3.75,0.17499999999999999,0.4,0.05,13.75,4.25,0,5,1.25,0,2.5,0,0,0.17499999999999999,0.12,0,0.04,0,6.5000000000000002E-2,0.01,0.16500000000000001,0,0,0.05]
[8,null,"Hög dos Fenmedifam","Daphna ",102.214,11.25,2.5,0.1,0.52500000000000002,0.05,10,0,12.5,1.25,0,0,1.25,0,3.2000000000000001E-2,6.7000000000000004E-2,0.14499999999999999,0.105,0,0,0.112,0,0.16300000000000001,0,0.05,0]
[9,null,"Utan Desmedifam + Fenmedifam stärkt med allt","Daphna ",108.07299999999999,12.5,1.25,0.2,0.3,0.05,11.25,3.5,0,1.25,0,1.25,1.25,0,0.03,0.17,8.5000000000000006E-2,0.02,0,0,0.01,0,0.185,0,0.05,0]
[10,null,"Tanaris","Daphna ",111.003,12.5,3.75,0.17499999999999999,0.52500000000000002,2.5000000000000001E-2,11.25,0,7.5,2.5,0,0,0,2.5000000000000001E-2,0,0.15,0.1,2.5000000000000001E-2,0,0,0.26,0,0.14000000000000001,0,2.5000000000000001E-2,0]
[11,null,"Goltix Queen (jämförs mot led 6)","Daphna ",114.258,5,1.25,0.4,1.325,0.4,6.25,0,3.75,0,0,1.25,0,0,0.14000000000000001,0.26,0.19700000000000001,0.35499999999999998,0,7.4999999999999997E-2,0.3,0,0.36,0,0.4,0]
[12,null,"pH-Opti","Daphna ",106.771,12.5,2.5,0.15,0.25,0.05,11.25,0,11.25,2.5,0,1.25,1.25,0,4.4999999999999998E-2,0.105,0.02,7.4999999999999997E-2,0,0,6.5000000000000002E-2,0,0.09,0,0.05,0]
[13,null,"Centium innan uppkomst","Daphna ",110.352,13.75,3.75,0.2,0.57499999999999996,0.2,11.25,1.75,0,1.25,0,0,2.5,9.5000000000000001E-2,0,0.105,0.22700000000000001,0.04,3.6999999999999998E-2,3.7999999999999999E-2,7.4999999999999997E-2,0,0.158,0.17500000000000002,0,2.5000000000000001E-2]
[14,null,"Safari Duo","Daphna ",100.911,11.25,5,0.15,0.35,0,10,0,8.75,2.5,0,0,3.75,0,0,0.15,0.11,3.5000000000000003E-2,0,5.0000000000000001E-3,0,0,0.2,0,0,0]
["LSD",null,null,null,"ns",3.4670000000000001,"ns",0.64700000000000002,3.2559999999999998,1.29,3.738,null,5.149,"ns",null,"ns","ns",null,0.496,0.24,1.1870000000000001,0.81899999999999995,"ns",0.38900000000000001,0.67800000000000005,null,0.9,null,0.98399999999999999]
["CV",null,null,null,9.8829999999999991,26.256,160.816,96.56,116.91800000000001,248.899,30.271000000000001,205.57889345523552,82.570999999999998,203.67,374.16573867739413,334.66399999999999,201.93899999999999,321.4941065844211,225.44800000000001,72.123999999999995,216.09,196.697,505.59800000000001,139.08799999999999,123.69799999999999,353.92612620286735,125.44499999999999,294.6187563978815,239.465,280.17297377417611]
["P_value",null,null,null,0.52420962292034501,"<0,0001",0.83563751276730591,"<0,0001","<0,0001","<0,0001","<0,0001",null,"<0,0001",0.69871568466144307,null,0.75945347091011783,0.60821182995160039,null,"<0,0001","<0,0001","<0,0001","<0,0001",8.2935323002278905E-2,"<0,0001","<0,0001",null,"<0,0001",null,"<0,0001"]

{"sheet":"St U 102","index":10,"n_rows":25,"n_cols":43,"rows_kept":25,"cut":false,"hidden":false,"merged":[]}
[1,2,3,4,10,15,16,17,18,31,35,36,160,161,164,165,166,170,172,173,175,180,181,182,183,185,216,219,228,235,285,290,303,306,322,323,352,360,372,377,739,742,796]
[null,null,null,null,102,102,102,102,102,102,102,102,102,102,102,102,102,102,102,102,102,102,102,102,102,102,102,102,102,102,102,102,102,102,102,102,102,102,102,102,102,102,102]
["Series 536 (trial no 102)",null,null,null,"Plant nr","Rot","Socker","Socker","Socker","Renhet","K+Na","Blåtal","Generell fytotox ","Generell fytotox ","Marktäckning ogräs","Marktäckning ogräs","Marktäckning ogräs","Biomassareduktion","Vitfärgning","Kloros","Missbildade blad ","Biomassareduktion","Eftersatt höjdtillväxt ","Vitfärgning","Kloros","Missbildade blad ","Spillraps","Svinmålla","Skatnäva","Snärjmåra","Åkerveronika","Åkerviol","Spillraps","Svinmålla","Snärjmåra","Fliknäva","Åkerbinda","Nattskatta","Åkerveronika","Åkerviol","Spillraps","Svinmålla","Nattskatta"]
["St Uppåkra",null,null,null,"Plant no","Root ","Sugar","Sugar","Sugar","Cleaness","K+Na","Amino-N","gen_phy","gen_phy","Ground cover","Ground cover","Ground cover","vor_phy","ble_phy","chl_phy","def_phy","vor_phy","stu_phy","ble_phy","chl_phy","def_phy","BRSNN","CHEAL","EROCI","GALAP","VERAG","VIOAR","BRSNN","CHEAL","GALAP","GERDI","POLCO","SOLNI","VERAG","VIOAR","BRSNN","CHEAL","SOLNI"]
["Expl.",null,null,null,"Final ",null,null,null,null,null,"pr 100g beet","pr 100g beet","First grading","Second grading","First grading","Below, Aug","Above foliage","First grading","First grading","First grading","First grading","Second grading","Second grading","Second grading","Second grading","Second grading","First grading","First grading","First grading","First grading","First grading","First grading","Second grading","Second grading","Second grading","Second grading","Second grading","Second grading","Second grading","Second grading","Above in August","Above in August","Above in August"]
["no trials"]
["Unit",null,null,null,"1000/ha","t/ha","%","t/ha","relative","%","mmol","mg ","1-30","1-30","% ","% ","% in Aug ","%","%","%","%","%","%","%","%","%","% ","% ","% ","% ","% ","% ","% ","% ","% ","% ","% ","% ","% ","% ","%","%","%"]
[null,null,null,null,110.67700000000001,68.507999999999996,17.216999999999999,11.811,100,84.91,3.843,17,8,3.75,2,0.9,3.3000000000000002E-2,7.5,0,1.25,0,2.5,1.25,1.25,0,0,0,0.5,0.25,0,1.7,0.05,0,5.2999999999999999E-2,0,0.2,0,0.183,0.46300000000000002,0,0,3.3000000000000002E-2,0]
[1,null,"Obehandlat","Daphna ",99.935000000000002,null,null,null,null,"",null,null,2.5,0,50,53.332999999999998,66.667000000000002,2.5,0,1.25,0,0,0,0,0,0,5,40,7.6669999999999998,5,5,5.1669999999999998,8.6669999999999998,9.6669999999999998,3,6,11,8.6669999999999998,1,5.3330000000000002,6.666666666666667,53.332999999999998,6.666666666666667]
[2,"R","Conviso smart","Renja KWS",110.67700000000001,68.507999999999996,17.216999999999999,11.811,100,84.91,3.843,17,8,3.75,2,0.9,3.3000000000000002E-2,7.5,0,1.25,0,2.5,1.25,1.25,0,0,0,0.5,0.25,0,1.7,0.05,0,5.2999999999999999E-2,0,0.2,0,0.183,0.46300000000000002,0,0,3.3000000000000002E-2,0]
[3,null,"Conviso smart förstärkt med Tanaris","Renja KWS",112.63,null,null,null,null,"",null,null,7.5,0,0.8,0.66700000000000004,2.7,7.5,0,0,0,0,0,0,0,0,0,0.53300000000000003,0.12,0.17299999999999999,0.46700000000000003,0,0,0.21299999999999999,0,2.7E-2,0,0,0.42699999999999999,0,0,2.7,0]
[4,null,"Betanal Power","Daphna ",105.46899999999999,82.484999999999999,16.18,13.35,113.03022606045212,91.197000000000003,4.1870000000000003,19.667000000000002,15,7.5,2,2.5,4.1669999999999998,13.75,0,2.5,0.25,6.25,0,0,0,0,0,2,0.15,0.25,0.17499999999999999,0.625,0.15,0.5,0.05,0.2,0.5,0.4,0,0.7,0,4.1669999999999998,0]
[5,null,"Utan Desmedifam","Daphna ",108.07299999999999,83.450999999999993,16.396999999999998,13.683999999999999,115.85809838286343,90.519000000000005,4.2229999999999999,16,10,2.5,3.6669999999999998,6,4.1669999999999998,10,0.5,3.75,0.25,1.25,1.25,0,0,0,0,3.6669999999999998,0.2,0.183,0.33300000000000002,1.1000000000000001,0.7,1.2,0.2,1.1000000000000001,1.4,0.2,0,1.2,0,4.1669999999999998,0]
[6,null,"Utan Desmedifam och Fenmedifam","Daphna ",102.539,81.034999999999997,16.343,13.247999999999999,112.16662433324866,90.85,4.0970000000000004,20.667000000000002,13.75,3.75,4.3330000000000002,5.5,3,10,0,0,0,1.25,1.25,0,1.25,0,0,2.6669999999999998,0,0.183,0.66700000000000004,1.05,0.65,1.05,0.4,0.1,1.65,0.6,0,1.05,0,3,0]
[7,null,"Utan Desmedifam stärkt med Centium","Daphna ",105.46899999999999,86.052999999999997,16.117000000000001,13.871,117.44136821606976,90.795000000000002,4.1429999999999998,21,16.25,3.75,4,3.2669999999999999,3.5,11.25,3.75,0,0.25,0,1.25,1.25,1.25,0,0,4,0.35,0.05,0.4,1.6,0.753,0.45300000000000001,0,0.6,0.68,0.45300000000000001,0,0.32700000000000001,0,3.5,0]
[8,null,"Hög dos Fenmedifam","Daphna ",109.70099999999999,83.302999999999997,16.09,13.403,113.47896029125393,90.457999999999998,4.1100000000000003,19.332999999999998,10,2.5,2.5,2,3.5,7.5,0,2.5,0,2.5,0,0,0,0,0,2.4,0.15,0.05,0.15,0.85,0.2,0.45,0,0.2,0.3,0.3,0,0.55000000000000004,0,3.45,4.9999999999999996E-2]
[9,null,"Utan Desmedifam + Fenmedifam stärkt med allt","Daphna ",102.214,null,null,null,null,"",null,null,13.75,6.25,2.2669999999999999,2.5,2,11.25,1.25,0,0.25,1.25,2.5,1.25,0,2.5,0,2.2669999999999999,0.2,0,0,0.98,0.35,0.35,0,0.25,0.6,0.5,0,0.45,0,2,0]
[10,null,"Tanaris","Daphna ",106.44499999999999,null,null,null,null,"",null,null,10,5,5.5,5,6.6669999999999998,10,0.5,1.25,0.5,1.25,1.25,1.25,0,0,0,5.5,0.9,0.25,0.05,1.7,0.15,1.05,0,1.2,1.1000000000000001,0.9,0,0.6,0,6.6669999999999998,0]
[11,null,"Goltix Queen (jämförs mot led 6)","Daphna ",107.422,83.265000000000001,16.27,13.535,114.59656252645838,90.953000000000003,3.9929999999999999,18.332999999999998,12.5,2.5,7.5,5,4,8.75,1.25,0,0,0,1.25,0,0,1.25,0,7.5,0.29199999999999998,0.16700000000000001,0.45800000000000002,2.8330000000000002,0.6,1,0.7,0.4,0.6,0.8,0.1,0.8,0,4,0]
[12,null,"pH-Opti","Daphna ",100.911,null,null,null,null,"",null,null,13.75,3.75,9,12.667,9,8.75,0,2.5,0,3.75,1.25,0,0,0,0,9,1.3,0.2,0.25,3.55,0.4,2.5329999999999999,0.8,3.7330000000000001,2.5329999999999999,1.4,0,1.2669999999999999,0,9,0]
[13,null,"Centium innan uppkomst","Daphna ",107.422,null,null,null,null,"",null,null,12.5,1.25,5,5,3.6669999999999998,10,1,0,0.25,0,1.25,0,0,0,0,5,0.5,0.25,0.5,1.25,0.8,1,0,0.6,1,0.8,0,0.8,0,3.6669999999999998,0]
[14,null,"Safari Duo","Daphna ",109.375,86.908000000000001,17.222999999999999,14.973000000000001,126.77165354330708,91.683000000000007,4.4800000000000004,23.332999999999998,11.25,1.25,4.3330000000000002,4,2.5,10,0,0.5,0,0,0,0,0,0,0,4.3330000000000002,0.85,0,0.68300000000000005,1.5329999999999999,0.4,0.55000000000000004,0,0.7,0.8,0.9,0.15,0.5,0,2.5,0]
["LSD",null,null,null,"ns",8.827,"ns","ns",null,1.329,0.32,"ns",5.3529999999999998,"ns",5.9020000000000001,7.4020000000000001,5.3529999999999998,4.1929999999999996,1.468,"ns","ns","ns","ns",null,null,null,null,5.3970000000000002,1.81,0.55300000000000005,0.85199999999999998,2.294,1.4219999999999999,1.4,1.4830000000000001,"ns",1.694,1.663,"ns",1.018,null,5.1280000000000001]
["CV",null,null,null,5.2030000000000003,6.5810000000000004,3.0529999999999999,7.5590000000000002,null,0.9,4.718,17.693999999999999,34.911999999999999,100.81,49.972000000000001,59.531999999999996,40.354999999999997,33.293999999999997,181.886,195.54,269.03699999999998,190.941,210.29900000000001,164.08253082847338,254.19556372089701,270.16930431019176,374.16573867739413,52.621000000000002,121.982,71.260999999999996,68.504999999999995,89.671999999999997,89.665000000000006,60.783000000000001,250.81299999999999,200.078,66.575000000000003,89.968999999999994,309.697,65.346999999999994,374.16573867739413,43.722000000000001,371.17651698572791]
["P_value",null,null,null,6.0330461945560687E-2,"<0.05",6.0326612137440838E-2,0.10151157325121918,null,"<0,0001","<0.05",0.28513770553472084,"<0.05",5.9073611397395087E-2,"<0,0001","<0,0001","<0,0001","<0.05","<0.001",0.22663983583978542,0.52685852805045363,7.7078182230762016E-2,0.7857998824292316,null,null,null,null,"<0,0001","<0,0001","<0,0001","<0,0001","<0.05","<0,0001","<0,0001","<0.05",9.7338663758619437E-2,"<0,0001","<0,0001",0.37621803519277486,"<0,0001",null,"<0,0001"]

{"sheet":"Alna 103","index":11,"n_rows":25,"n_cols":33,"rows_kept":25,"cut":false,"hidden":false,"merged":[]}
[1,2,3,4,10,15,16,17,18,31,35,36,160,161,164,165,166,170,172,173,175,182,185,188,216,219,235,306,360,369,377,742,796]
[null,null,null,null,103,103,103,103,103,103,103,103,103,103,103,103,103,103,103,103,103,103,103,103,103,103,103,103,103,103,103,103,103]
["Series 536 (trial no 103)",null,null,null,"Plant nr","Rot","Socker","Socker","Socker","Renhet","K+Na","Blåtal","Generell fytotox ","Generell fytotox ","Marktäckning ogräs","Marktäckning ogräs","Marktäckning ogräs","Biomassareduktion","Vitfärgning","Kloros","Missbildade blad ","Vitfärgning","Missbildade blad ","Försenad tillväxt ","Spillraps","Svinmålla","Snärjmåra","Svinmålla","Nattskatta","Ogräs Ospec","Åkerviol","Svinmålla","Nattskatta"]
["Alnarp",null,null,null,"Plant no","Root ","Sugar","Sugar","Sugar","Cleaness","K+Na","Amino-N","gen_phy","gen_phy","Ground cover","Ground cover","Ground cover","vor_phy","ble_phy","chl_phy","def_phy","ble_phy","def_phy","phy_del","BRSNN","CHEAL","GALAP","CHEAL","SOLNI","TTTTT","VIOAR","CHEAL","SOLNI"]
["Expl.",null,null,null,"Final ",null,null,null,null,null,"pr 100g beet","pr 100g beet","First grading","Second grading","First grading","Below, Aug","Above foliage","First grading","First grading","First grading","First grading","Second grading","Second grading","Second grading","First grading","First grading","First grading","Second grading","Second grading","Second grading","Second grading","Above in August","Above in August"]
["no trials"]
["Unit",null,null,null,"1000/ha","t/ha","%","t/ha","relative","%","mmol","mg ","1-30","1-30","% ","% ","% in Aug ","%","%","%","%","%","%","%","% ","% ","% ","% ","% ","% ","% ","%","%"]
[null,null,null,null,105.46899999999999,81.043999999999997,17.420000000000002,14.121,100,77.921000000000006,3.8929999999999998,19.5,7.5,0,0.15,2.5000000000000001E-2,0.1,7.5,0,0,0,0,0,0,0,0,0.01,0,0,0,2.5000000000000001E-2,0.1,0]
[1,null,"Obehandlat","Daphna ",109.375,79.846000000000004,16.29,12.992000000000001,92.004815522979968,84.411000000000001,4.0149999999999997,15,0,0,13.75,47.5,7.2750000000000004,0,0,0,0,0,0,0,0.83799999999999997,3.5129999999999999,1.1870000000000001,8.75,23,3.75,12,5.4749999999999996,1.8]
[2,"R","Conviso smart","Renja KWS",105.46899999999999,81.043999999999997,17.420000000000002,14.121,100,77.921000000000006,3.8929999999999998,19.5,7.5,0,0.15,2.5000000000000001E-2,0.1,7.5,0,0,0,0,0,0,0,0,0.01,0,0,0,2.5000000000000001E-2,0.1,0]
[3,null,"Conviso smart förstärkt med Tanaris","Renja KWS",112.30500000000001,null,"",null,null,"",null,null,6.25,0,7.4999999999999997E-2,0,0,6.25,0,0,0,0,0,0,0,0,0,0,0,0,0,0,0]
[4,null,"Betanal Power","Daphna ",102.86499999999999,96.054000000000002,16.233000000000001,15.584,110.36045605835281,84.117999999999995,4.1269999999999998,15.805999999999999,16.25,0,0.3,0.55000000000000004,2.5000000000000001E-2,15,0,7.5,0.25,0,0,0,7.0000000000000007E-2,0.02,0.115,0,0.125,0,0.42499999999999999,2.5000000000000001E-2,0]
[5,null,"Utan Desmedifam","Daphna ",106.44499999999999,98.412999999999997,16.707000000000001,16.422000000000001,116.29487996600807,85.87,4.4550000000000001,16.5,13.75,1.25,0.45,0.6,0.1,11.25,0,12.5,0.5,0,0,1.25,9.5000000000000001E-2,0.04,0.01,0.17,0.15,0,0.28000000000000003,0.1,0]
[6,null,"Utan Desmedifam och Fenmedifam","Daphna ",106.44499999999999,101.536,16.225000000000001,16.471,116.64188088662274,86.572000000000003,4.2549999999999999,16.75,12.5,0,0.55000000000000004,0.55000000000000004,0.75,11.25,0,10,0.25,0,0,0,0,0.08,0.04,0.15,0.16,0,0.24,0.75,0]
[7,null,"Utan Desmedifam stärkt med Centium","Daphna ",103.84099999999999,100.97799999999999,16.350000000000001,16.507999999999999,116.90390198994405,85.004999999999995,3.9780000000000002,17.25,15,6.25,0.35,0.95,0.85,11.25,6.25,1.25,0,3.75,0,1.25,3.5000000000000003E-2,0.08,1.4999999999999999E-2,0.41499999999999998,0.03,0,0.505,0.75,0]
[8,null,"Hög dos Fenmedifam","Daphna ",107.096,98.328999999999994,16.190000000000001,15.92,112.7398909425678,85.247,4.2679999999999998,16,15,0,0.375,0.3,0,13.75,0,12.5,1.5,0,0,0,0.04,0,0.06,0.08,0.155,0,6.5000000000000002E-2,0,0]
[9,null,"Utan Desmedifam + Fenmedifam stärkt med allt","Daphna ",104.492,null,"",null,null,"",null,null,13.75,7.5,0.25,0.25,0,13.75,2,3.75,0.25,7.5,1.25,2.5,3.5000000000000003E-2,0.01,0,0.05,0,0,0.2,0,0]
[10,null,"Tanaris","Daphna ",103.84099999999999,null,"",null,null,"",null,null,12.5,3.75,0.22500000000000001,0.3,0,11.25,0,7.5,0.5,0,0,3.75,0,0.04,0,0,0,0,0.3,0,0]
[11,null,"Goltix Queen (jämförs mot led 6)","Daphna ",107.422,99.722999999999999,16.222999999999999,16.178000000000001,114.56695701437576,86.116,4.26,16.25,13.75,1.25,0.45,0.6,0.05,11.25,0,11.25,0,0,0,1.25,5.0000000000000001E-3,3.5000000000000003E-2,0.03,0.22,0.08,0,0.3,0.05,0]
[12,null,"pH-Opti","Daphna ",107.747,null,"",null,null,"",null,null,12.5,2.5,0.3,0.25,0.15,12.5,0,10,0,2.5,0,0,7.0000000000000007E-2,2.5000000000000001E-2,5.5E-2,0.105,0.125,0,0.02,0.05,0]
[13,null,"Centium innan uppkomst","Daphna ",108.398,null,"",null,null,"",null,null,12.5,1.25,0.625,0.625,2.5000000000000001E-2,12.5,4,0,0,0,0,1.25,0.1,0.03,0.11799999999999999,0.35299999999999998,5.7000000000000002E-2,0,0.215,2.5000000000000001E-2,0]
[14,null,"Safari Duo","Daphna ",110.026,102.846,16.14,16.600999999999999,117.56249557396782,85.082999999999998,3.8780000000000001,16,12.5,0,0.25,0.3,0,11.25,0,12.5,0.25,0,0,0,0,5.0000000000000001E-3,0.13500000000000001,7.4999999999999997E-2,0,0,0.22500000000000001,0,0]
["LSD",null,null,null,"ns",9.3000000000000007,0.42099999999999999,1.4690000000000001,null,2.089,"ns","ns",3.621,3.2330000000000001,1.8720000000000001,6.2670000000000003,3.3130000000000002,3.2989999999999999,null,3.9390000000000001,"ns",null,null,"ns",0.317,0.69699999999999995,0.22600000000000001,1.0580000000000001,5.2110000000000003,null,0.71299999999999997,2.3279999999999998]
["CV",null,null,null,4.399,6.9320000000000004,1.8240000000000001,6.6790000000000003,null,1.758,10.35,14.077999999999999,22.611000000000001,139.179,105.72,121.35,363.21899999999999,22.673999999999999,220.38926600773587,45.381,283.87700000000001,224.24557422345006,374.16573867739413,209.251,251.51599999999999,183.75800000000001,130.41900000000001,104.28700000000001,223.08699999999999,374.16573867739413,49.223999999999997,324.98500000000001,374.16573867739407]
["P_value",null,null,null,0.26817384714576842,"<0.001","<0,0001","<0.001",null,"<0,0001",0.5612745955284274,0.36065920881687141,"<0,0001","<0.001","<0,0001","<0,0001","<0.05","<0,0001",null,"<0,0001",0.25532222706305308,null,null,5.7435636907201992E-2,"<0.001","<0,0001","<0,0001","<0,0001","<0,0001",null,"<0,0001","<0.05"]

{"sheet":"Laxm 104","index":12,"n_rows":25,"n_cols":35,"rows_kept":25,"cut":false,"hidden":false,"merged":[]}
[1,2,3,4,15,16,17,18,31,35,36,160,161,164,165,166,170,172,173,175,182,183,185,188,216,219,265,290,303,306,350,352,354,739,742]
[null,null,null,null,104,104,104,104,104,104,104,104,104,104,104,104,104,104,104,104,104,104,104,104,104,104,104,104,104,104,104,104,104,104,104]
["Series 536 (trial no 104)",null,null,null,"Rot","Socker","Socker","Socker","Renhet","K+Na","Blåtal","Generell fytotox ","Generell fytotox ","Marktäckning ogräs","Marktäckning ogräs","Marktäckning ogräs","Biomassareduktion","Vitfärgning","Kloros","Missbildade blad ","Vitfärgning","Kloros","Missbildade blad ","Försenad tillväxt ","Spillraps","Svinmålla","Åkerbinda","Åkerviol","Spillraps","Svinmålla","Trampört","Åkerbinda","Vanlig Pilört","Spillraps","Svinmålla"]
["Laxman",null,null,null,"Root ","Sugar","Sugar","Sugar","Cleaness","K+Na","Amino-N","gen_phy","gen_phy","Ground cover","Ground cover","Ground cover","vor_phy","ble_phy","chl_phy","def_phy","ble_phy","chl_phy","def_phy","phy_del","BRSNN","CHEAL","POLCO","VIOAR","BRSNN","CHEAL","POLAV","POLCO","POLLA","BRSNN","CHEAL"]
["Expl.",null,null,null,null,null,null,null,null,"pr 100g beet","pr 100g beet","First grading","Second grading","First grading","Below, Aug","Above foliage","First grading","First grading","First grading","First grading","Second grading","Second grading","Second grading","Second grading","First grading","First grading","First grading","First grading","Second grading","Second grading","Second grading","Second grading","Second grading","Above in August","Above in August"]
["no trials"]
["Unit",null,null,null,"t/ha","%","t/ha","relative","%","mmol","mg ","1-30","1-30","% ","% ","% in Aug ","%","%","%","%","%","%","%","%","% ","% ","% ","% ","% ","% ","% ","% ","% ","%","%"]
[null,null,null,null,77.001999999999995,17.422000000000001,13.416,100,75.552000000000007,2.9649999999999999,11.5,5,0,0.25,0.125,0.05,6.25,0,0,0,0,0,0,0,0,9.5000000000000001E-2,0.155,0,0,7.4999999999999997E-2,0,0.05,0,0,0.05]
[1,null,"Obehandlat","Daphna ",null,"",null,null,null,null,null,0,0,14.625,21.25,25,0,0,0,0,0,0,0,0,0.56200000000000006,7.8,3.0379999999999998,0.56200000000000006,4.5,5.125,1,10.375,0.25,1.375,23.625]
[2,"R","Conviso smart","Renja KWS",77.001999999999995,17.422000000000001,13.416,100,75.552000000000007,2.9649999999999999,11.5,5,0,0.25,0.125,0.05,6.25,0,0,0,0,0,0,0,0,9.5000000000000001E-2,0.155,0,0,7.4999999999999997E-2,0,0.05,0,0,0.05]
[3,null,"Conviso smart förstärkt med Tanaris","Renja KWS",null,"",null,null,null,null,null,5,0,0.92500000000000004,0.2,0,5,0,0,0,0,0,0,0,1.4999999999999999E-2,0.51500000000000001,0.39500000000000002,0,2.5000000000000001E-2,0.05,0,0.125,0,0,0]
[4,null,"Betanal Power","Daphna ",94.453999999999994,15.903,15.012,111.89624329159213,84.132000000000005,3.22,13.334,8.75,0,2.0750000000000002,1.325,0.27500000000000002,8.75,0,0,0,0,0,0,0,0,0.66,1.377,0,0.13500000000000001,0.45200000000000001,3.7999999999999999E-2,0.66200000000000003,3.7499999999999999E-2,0,0.27500000000000002]
[5,null,"Utan Desmedifam","Daphna ",88.042000000000002,15.99,14.077,104.92695289206917,84.549000000000007,3.3220000000000001,14,6.25,3.75,1.425,2.25,0.3,7.5,0,4.25,0,3.75,0,1.25,0,0.03,0.61499999999999999,0.76,0.02,0.22500000000000001,0.45,0.15,1.425,0,0,0.3]
[6,null,"Utan Desmedifam och Fenmedifam","Daphna ",89.631,15.863,14.222,106.00775193798448,83.459000000000003,3.04,13,10,1.25,2.75,3.375,0.55000000000000004,8.75,0,1.25,0,0,0,1.25,0,7.4999999999999997E-2,1.1870000000000001,1.3620000000000001,0,0.15,0.69399999999999995,3.7999999999999999E-2,2.4940000000000002,0,0,0.55000000000000004]
[7,null,"Utan Desmedifam stärkt med Centium","Daphna ",90.914000000000001,16.053000000000001,14.602,108.84019081693501,84.037000000000006,3.1970000000000001,12,15,6.25,2.0750000000000002,1.325,0.22500000000000001,12.5,7.5,0,0,8.75,0,0,3.75,0.28399999999999997,0.81,0.96199999999999997,0,0.55000000000000004,0.19,0,0.51,7.4999999999999997E-2,0,0.22500000000000001]
[8,null,"Hög dos Fenmedifam","Daphna ",88.99,16.012,14.250999999999999,106.22391174716755,84.081000000000003,3.29,13,8.75,2.5,1.875,1.7,0.22500000000000001,11.25,1.25,3.75,0,0,1.25,0,2.5,0.113,0.86199999999999999,0.86299999999999999,0,0.22700000000000001,0.42,7.4999999999999997E-2,0.97799999999999998,0,0,0.22500000000000001]
[9,null,"Utan Desmedifam + Fenmedifam stärkt med allt","Daphna ",null,"",null,null,null,null,null,13.75,3.75,4.5250000000000004,1.7,0.2,12.5,4.5,0,0.25,2.5,0,3.75,1.25,0.114,2.9870000000000001,1.1419999999999999,9.4E-2,0.1,0.377,0,1.2230000000000001,0,0,0.2]
[10,null,"Tanaris","Daphna ",null,"",null,null,null,null,null,10,2.5,1.7,2.25,0.3,10,0,0,0.75,0,0,1.25,1.25,0.02,0.56999999999999995,1.0349999999999999,7.4999999999999997E-2,0.15,0.78700000000000003,0,1.3129999999999999,0,0,0.3]
[11,null,"Goltix Queen (jämförs mot led 6)","Daphna ",84.501000000000005,16.233000000000001,13.715999999999999,102.23613595706618,82.884,3.2,11.5,8.75,0,7,2.625,1.25,8.75,0,4.5,0.5,0,0,0,0,0.15,2.8,3.9,0.15,0.15,0.78700000000000003,7.4999999999999997E-2,1.613,0,0,1.25]
[12,null,"pH-Opti","Daphna ",null,"",null,null,null,null,null,11.25,3.75,1.7250000000000001,1.5249999999999999,0.35,13.75,0,3.25,0.25,0,0,1.25,3.75,6.8000000000000005E-2,0.96,0.69699999999999995,0,9.5000000000000001E-2,0.28999999999999998,9.5000000000000001E-2,1.0449999999999999,0,0,0.35]
[13,null,"Centium innan uppkomst","Daphna ",null,"",null,null,null,null,null,8.75,1.25,2.75,2.8250000000000002,0.67500000000000004,11.25,2.75,0,0,0,0,0,1.25,0.188,1.325,1.2370000000000001,0,0.87,0.71799999999999997,0,1.2,3.7499999999999999E-2,0,0.67500000000000004]
[14,null,"Safari Duo","Daphna ",90.522999999999996,15.875,14.38,107.18545020870603,83.85,3.24,13.75,8.75,2.5,2.4500000000000002,1.9,0.27500000000000002,8.75,0,1.25,0,0,0,1.25,1.25,0.02,0.77700000000000002,1.653,0,0,0.435,0,1.4650000000000001,0,0,0.27500000000000002]
["LSD",null,null,null,6.0140000000000002,0.30299999999999999,"ns",null,3.004,0.17899999999999999,"ns",2.9009999999999998,"ns",5.4139999999999997,2.64,4.476,4.0919999999999996,null,1.9219999999999999,null,null,null,"ns","ns","ns",3.0430000000000001,1.413,"ns",0.83799999999999997,1.2270000000000001,"ns",1.222,null,null,4.0659999999999998]
["CV",null,null,null,4.8550000000000004,1.3280000000000001,5.5590000000000002,null,2.5720000000000001,3.99,13.96,24.713000000000001,173.44300000000001,119.94499999999999,60.828000000000003,154.21600000000001,33.466000000000001,199.14556065080404,107.67700000000001,188.10798862519204,232.69142473520407,374.16573867739413,275.37900000000002,244.19200000000001,221.57400000000001,141.61600000000001,77.786000000000001,338.52499999999998,119.325,115.607,355.863,51.033999999999999,236.80312741567869,374.16573867739413,146.89699999999999]
["P_value",null,null,null,"<0.001","<0,0001",0.24205726240752745,null,"<0.001","<0.05",0.34802199540583834,"<0,0001",0.25020631104845448,"<0.05","<0,0001","<0,0001","<0,0001",null,"<0,0001",null,null,null,0.33240941101690669,0.38257897884401082,0.210403357024881,"<0.05","<0.001",5.6142348994964841E-2,"<0,0001","<0,0001",5.2087388121328182E-2,"<0,0001",null,null,"<0,0001"]

{"sheet":"Resl 105","index":13,"n_rows":25,"n_cols":39,"rows_kept":25,"cut":false,"hidden":false,"merged":[]}
[1,2,3,4,10,15,16,17,18,31,35,36,160,161,164,165,166,170,172,173,175,216,265,285,290,303,306,339,343,350,352,357,372,377,739,742,775,779,793]
[null,null,null,null,105,105,105,105,105,105,105,105,105,105,105,105,105,105,105,105,105,105,105,105,105,105,105,105,105,105,105,105,105,105,105,105,105,105,105]
["Series 536 (trial no 105)",null,null,null,"Plant nr","Rot","Socker","Socker","Socker","Renhet","K+Na","Blåtal","Generell fytotox ","Generell fytotox ","Marktäckning ogräs","Marktäckning ogräs","Marktäckning ogräs","Biomassareduktion","Vitfärgning","Kloros","Missbildade blad ","Spillraps","Åkerbinda","Åkerveronika","Åkerviol","Spillraps","Svinmålla","Baldersbrå","Kornvallmo","Trampört","Åkerbinda","Korsört","Åkerveronika","Åkerviol","Spillraps","Svinmålla","Baldersbrå","Kornvallmo","Korsört"]
["Reslöv",null,null,null,"Plant no","Root ","Sugar","Sugar","Sugar","Cleaness","K+Na","Amino-N","gen_phy","gen_phy","Ground cover","Ground cover","Ground cover","vor_phy","ble_phy","chl_phy","def_phy","BRSNN","POLCO","VERAG","VIOAR","BRSNN","CHEAL","MATIN","PAPRH","POLAV","POLCO","SENVU","VERAG","VIOAR","BRSNN","CHEAL","MATIN","PAPRH","SENVU"]
["Expl.",null,null,null,"Final ",null,null,null,null,null,"pr 100g beet","pr 100g beet","First grading","Second grading","First grading","Below, Aug","Above foliage","First grading","First grading","First grading","First grading","First grading","First grading","First grading","First grading","Second grading","Second grading","Second grading","Second grading","Second grading","Second grading","Second grading","Second grading","Second grading","Above in August","Above in August","Above in August","Above in August","Above in August"]
["no trials"]
["Unit",null,null,null,"1000/ha","t/ha","%","t/ha","relative","%","mmol","mg ","1-30","1-30","% ","% ","% in Aug ","%","%","%","%","% ","% ","% ","% ","% ","% ","% ","% ","% ","% ","% ","% ","% ","%","%","%","%","%"]
[null,null,null,null,88.215999999999994,67.777000000000001,17.712,12.005000000000001,100,82.055000000000007,3.8079999999999998,16,5,0,0.9,0,0,7.5,0,0,0,0,0,0.9,0,0,0,0,0,0,0,0,0,0,0,0,0,0,0]
[1,null,"Obehandlat","Daphna ",85.611999999999995,64.954999999999998,15.994999999999999,10.388,86.530612244897952,87.387,3.94,10.5,0,0,68.75,22.5,6.25,0,0,0,0,1.7190000000000001,12.186999999999999,27.625,22.062999999999999,2.8119999999999998,0.25,2.25,2.625,0.875,7.3120000000000003,1.0625,0.875,4.4370000000000003,1.425,1.75,0.15000000000000002,2,0.92500000000000004]
[2,"R","Conviso smart","Renja KWS",88.215999999999994,67.777000000000001,17.712,12.005000000000001,100,82.055000000000007,3.8079999999999998,16,5,0,0.9,0,0,7.5,0,0,0,0,0,0.9,0,0,0,0,0,0,0,0,0,0,0,0,0,0,0]
[3,null,"Conviso smart förstärkt med Tanaris","Renja KWS",85.936999999999998,"","","",null,"",null,null,5,0,0.3,0.15,0,5,0,0,0,0,0,0.3,0,0,0,0,0,0,0.05,0.1,0,0,0,0,0,0,0]
[4,null,"Betanal Power","Daphna ",86.263000000000005,91.551000000000002,16.114999999999998,14.733000000000001,122.72386505622657,88.513999999999996,4.1150000000000002,14.25,7.5,0,0.4,0.42499999999999999,0,7.5,0,0,0,1.4999999999999999E-2,0.13,0.01,0.245,0.20300000000000001,0,0,0,0.04,0.11,0,0,7.2999999999999995E-2,0,0,0,0,0]
[5,null,"Utan Desmedifam","Daphna ",83.332999999999998,90.893000000000001,16.128,14.654,122.0658059142024,88.888999999999996,4.0179999999999998,13.75,5,0,0.4,0.42499999999999999,0.05,6.25,0.25,0.75,0,0.02,3.3000000000000002E-2,0,0.34699999999999998,0.16,0,0,0.04,2.5000000000000001E-2,0,0,0,0.2,0,0.05,0,0,0]
[6,null,"Utan Desmedifam och Fenmedifam","Daphna ",86.588999999999999,89.543999999999997,16.128,14.439,120.27488546438983,87.97,3.9550000000000001,13,5,0,7.25,2.625,0.15,6.25,0,0,0,0,2.7,0.2,4.3499999999999996,0.22500000000000001,0,0,0.15,7.4999999999999997E-2,1.1619999999999999,3.7500000000000006E-2,0.15000000000000002,0.82499999999999996,0,0.05,0,0.1,0]
[7,null,"Utan Desmedifam stärkt med Centium","Daphna ",82.356999999999999,90.328000000000003,16.016999999999999,14.464,120.48313202832152,88.715999999999994,4.07,14,8.75,0,0.875,0.67500000000000004,0,8.75,3,0,0,6.9000000000000006E-2,0,0,0.80600000000000005,0.29199999999999998,0,0,0.03,0.05,7.4999999999999997E-2,0,0,0.22800000000000001,0,0,0,0,0]
[8,null,"Hög dos Fenmedifam","Daphna ",87.564999999999998,91.394000000000005,16.178000000000001,14.781000000000001,123.12369845897541,88.54,4.1970000000000001,14.25,8.75,0,0.3,0.42499999999999999,0.1,10,0.25,3.25,0.25,0,0.16,0,0.14000000000000001,2.5000000000000001E-2,0,0,0.06,0,0.16,0,0,0.18,0,0,0,0.1,0]
[9,null,"Utan Desmedifam + Fenmedifam stärkt med allt","Daphna ",86.263000000000005,"","","",null,"",null,null,8.75,0,1.7,0.97499999999999998,0,7.5,1.5,0,0.25,0,0.27300000000000002,0,1.427,0.17299999999999999,0,0,0,0.02,0.28999999999999998,0,0,0.29299999999999998,0,0,0,0,0]
[10,null,"Tanaris","Daphna ",84.31,"","","",null,"",null,null,10,0,0.95,0.5,0,10,0.25,3.25,0.5,0,0.13500000000000001,0,0.81499999999999995,7.0000000000000007E-2,0,0,0,0.06,0.16,0,0,0.21,0,0,0,0,0]
[11,null,"Goltix Queen (jämförs mot led 6)","Daphna ",86.914000000000001,89.590999999999994,15.935,14.272,118.8837984173261,87.89,3.968,13.75,6.25,0,5.875,3.1,0.2,7.5,0,0,0,0,1.95,3.6999999999999998E-2,3.887,7.4999999999999997E-2,7.5000000000000011E-2,0,0.1,0.3,1.6,0,0,0.95,0,0.2,0,0,0]
[12,null,"pH-Opti","Daphna ",85.938000000000002,"","","",null,"",null,null,8.75,0,1.1499999999999999,0.97499999999999998,0.05,8.75,0,3,0.25,0,0.46,0,0.69,0.08,0,0,5.7000000000000002E-2,3.6999999999999998E-2,0.2,0,0,0.6,0,0,0,0.05,0]
[13,null,"Centium innan uppkomst","Daphna ",89.843999999999994,"","","",null,"",null,null,5,0,1.05,0.77500000000000002,0.05,5,1,0,0,0.18,0.218,0.02,0.63200000000000001,0.313,0,0,0.05,7.8E-2,7.0000000000000007E-2,0,0,0.26500000000000001,0,0.05,0,0,0]
[14,null,"Safari Duo","Daphna ",89.192999999999998,88.227000000000004,16.045000000000002,14.156000000000001,117.91753436068304,88.3,4.0220000000000002,15,8.75,0,3.125,1.425,0.1,7.5,0.25,1.25,0,0,0.81299999999999994,0.15,2.1619999999999999,0.04,0,0,0.06,0.04,0.44500000000000001,0,0,0.84,0,0,0,0.1,0]
["LSD",null,null,null,"ns",8.4949999999999992,0.33700000000000002,1.26,null,0.873,"ns",1.619,2.4780000000000002,null,3.6709999999999998,4.4710000000000001,0.86399999999999999,2.9740000000000002,0.50800000000000001,1.8240000000000001,null,0.11,1.4750000000000001,2.6040000000000001,2.641,0.38400000000000001,null,null,0.42299999999999999,0.192,2.2410000000000001,null,null,1.2230000000000001,null,0.66800000000000004,null,0.16200000000000001]
["CV",null,null,null,3.8250000000000002,7.2709999999999999,1.5089999999999999,6.6539999999999999,null,0.72399999999999998,4.3440000000000003,8.5050000000000008,27.385000000000002,null,40.347000000000001,130.685,127.11799999999999,31.183,79.826999999999998,162.179,177.33063425746224,56.387999999999998,79.152000000000001,91.046000000000006,71.875,87.816000000000003,294.06200442898739,374.16573867739407,136.179,122.414,196.95099999999999,329.57922053254151,319.89078582911986,137.381,374.16573867739419,325.25,374.16573867739413,70.608999999999995,374.16573867739419]
["P_value",null,null,null,0.13239689196893389,"<0,0001","<0,0001","<0,0001",null,"<0,0001",0.15457983377351081,"<0.001","<0,0001",null,"<0,0001","<0,0001","<0,0001","<0,0001","<0,0001","<0.001",null,"<0,0001","<0,0001","<0,0001","<0,0001","<0,0001",null,null,"<0,0001","<0,0001","<0,0001",null,null,"<0,0001",null,"<0.001",null,"<0,0001"]

{"sheet":"Alnarp + Reslöv","index":14,"n_rows":20,"n_cols":46,"rows_kept":20,"cut":false,"hidden":false,"merged":[]}
[1,2,3,4,10,15,16,17,18,31,35,36,160,161,164,165,166,170,172,173,175,182,188,216,219,235,265,285,290,303,306,339,343,350,352,357,360,369,372,377,739,742,775,779,793,796]
[null,null,null,null,"2 fs","2 fs","2 fs","2 fs","2 fs","2 fs","2 fs","2 fs","2 fs","2 fs","2 fs","2 fs","2 fs","2 fs","2 fs","2 fs","2 fs","2 fs","2 fs","2 fs","2 fs","2 fs","2 fs","2 fs","2 fs","2 fs","2 fs","2 fs","2 fs","2 fs","2 fs","2 fs","2 fs","2 fs","2 fs","2 fs","2 fs","2 fs","2 fs","2 fs","2 fs","2 fs"]
["Series 536 (trial no 2 fs)",null,null,null,"Plant nr","Rot","Socker","Socker","Socker","Renhet","K+Na","Blåtal","Generell fytotox ","Generell fytotox ","Marktäckning ogräs","Marktäckning ogräs","Marktäckning ogräs","Biomassareduktion","Vitfärgning","Kloros","Missbildade blad ","Vitfärgning","Försenad tillväxt ","Spillraps","Svinmålla","Snärjmåra","Åkerbinda","Åkerveronika","Åkerviol","Spillraps","Svinmålla","Baldersbrå","Kornvallmo","Trampört","Åkerbinda","Korsört","Nattskatta","Ogräs Ospec","Åkerveronika","Åkerviol","Spillraps","Svinmålla","Baldersbrå","Kornvallmo","Korsört","Nattskatta"]
[null,null,null,null,"Plant no","Root ","Sugar","Sugar","Sugar","Cleaness","K+Na","Amino-N","gen_phy","gen_phy","Ground cover","Ground cover","Ground cover","vor_phy","ble_phy","chl_phy","def_phy","ble_phy","phy_del","BRSNN","CHEAL","GALAP","POLCO","VERAG","VIOAR","BRSNN","CHEAL","MATIN","PAPRH","POLAV","POLCO","SENVU","SOLNI","TTTTT","VERAG","VIOAR","BRSNN","CHEAL","MATIN","PAPRH","SENVU","SOLNI"]
["Expl.",null,null,null,"Final ",null,null,null,null,null,"pr 100g beet","pr 100g beet","First grading","Second grading","First grading","Below, Aug","Above foliage","First grading","First grading","First grading","First grading","Second grading","Second grading","First grading","First grading","First grading","First grading","First grading","First grading","Second grading","Second grading","Second grading","Second grading","Second grading","Second grading","Second grading","Second grading","Second grading","Second grading","Second grading","Above in August","Above in August","Above in August","Above in August","Above in August","Above in August"]
["no trials"]
["Unit",null,null,null,"1000/ha","t/ha","%","t/ha","relative","%","mmol","mg ","1-30","1-30","% ","% ","% in Aug ","%","%","%","%","%","%","% ","% ","% ","% ","% ","% ","% ","% ","% ","% ","% ","% ","% ","% ","% ","% ","% ","%","%","%","%","%","%"]
[null,null,null,null,96.841999999999999,74.411000000000001,17.565999999999999,13.063000000000001,100,79.988,3.85,17.75,6.25,0,0.52500000000000002,1.2999999999999999E-2,0.05,7.5,0,0,0,0,0,0,0,5.0000000000000001E-3,0,0.45,0,0,0,0,0,0,0,0,0,0,0,1.2E-2,0,0.05,0,0,0,0]
[1,null,"Obehandlat","Daphna ",97.492999999999995,72.400000000000006,16.141999999999999,11.69,89.489397535022576,85.899000000000001,3.9769999999999999,12.75,0,0,41.25,35,6.7629999999999999,0,0,0,0,0,0,1.278,1.756,0.59399999999999997,6.0940000000000003,13.811999999999999,11.031000000000001,1.4059999999999999,4.5,1.125,1.3120000000000001,0.437,3.6560000000000001,0.53125,11.5,1.875,0.4375,8.2189999999999994,0.71250000000000002,3.613,7.5000000000000011E-2,1,0.46250000000000002,0.9]
[2,"R","Conviso smart","Renja KWS",96.841999999999999,74.411000000000001,17.565999999999999,13.063000000000001,100,79.988,3.85,17.75,6.25,0,0.52500000000000002,1.2999999999999999E-2,0.05,7.5,0,0,0,0,0,0,0,5.0000000000000001E-3,0,0.45,0,0,0,0,0,0,0,0,0,0,0,1.2E-2,0,0.05,0,0,0,0]
[4,null,"Betanal Power","Daphna ",94.563999999999993,94.206000000000003,16.175999999999998,15.231,116.59649391410854,86.412000000000006,4.125,15.116,11.875,0,0.35,0.48799999999999999,1.2999999999999999E-2,11.25,0,3.75,0.125,0,0,4.2999999999999997E-2,0.01,5.7000000000000002E-2,6.5000000000000002E-2,5.0000000000000001E-3,0.123,0.10100000000000001,0,0,0,0.02,5.5E-2,0,6.2E-2,0,0,0.249,0,1.2999999999999999E-2,0,0,0,0]
[5,null,"Utan Desmedifam","Daphna ",94.888999999999996,94.653000000000006,16.417000000000002,15.538,118.94664319069126,87.379000000000005,4.2359999999999998,15.125,9.375,0.625,0.42499999999999999,0.51300000000000001,7.4999999999999997E-2,8.75,0.125,6.625,0.25,0,0.625,5.8000000000000003E-2,0.02,5.0000000000000001E-3,1.6E-2,0,0.17399999999999999,0.08,8.5000000000000006E-2,0,0.02,1.2E-2,0,0,7.4999999999999997E-2,0,0,0.24,0,7.4999999999999997E-2,0,0,0,0]
[6,null,"Utan Desmedifam och Fenmedifam","Daphna ",96.516999999999996,95.54,16.175999999999998,15.455,118.31126081298322,87.271000000000001,4.1050000000000004,14.875,8.75,0,3.9,1.5880000000000001,0.45,8.75,0,5,0.125,0,0,0,0.04,0.02,1.35,0.1,2.1749999999999998,0.113,7.4999999999999997E-2,0,7.4999999999999997E-2,3.6999999999999998E-2,0.58099999999999996,1.8750000000000003E-2,0.08,0,7.5000000000000011E-2,0.53200000000000003,0,0.4,0,0.05,0,0]
[7,null,"Utan Desmedifam stärkt med Centium","Daphna ",93.099000000000004,95.653000000000006,16.184000000000001,15.486000000000001,118.5485723034525,86.861000000000004,4.024,15.625,11.875,3.125,0.61299999999999999,0.81299999999999994,0.42499999999999999,10,4.625,0.625,0,1.875,0.625,5.1999999999999998E-2,0.04,7.0000000000000001E-3,0,0,0.40300000000000002,0.14599999999999999,0.20799999999999999,0,1.4999999999999999E-2,2.5000000000000001E-2,3.6999999999999998E-2,0,1.4999999999999999E-2,0,0,0.36599999999999999,0,0.375,0,0,0,0]
[8,null,"Hög dos Fenmedifam","Daphna ",97.331000000000003,94.861999999999995,16.184000000000001,15.35,117.50746382913573,86.893000000000001,4.2320000000000002,15.125,11.875,0,0.33800000000000002,0.36299999999999999,0.05,11.875,0.125,7.875,0.875,0,0,0.02,0,0.03,0.08,0,7.0000000000000007E-2,1.2999999999999999E-2,0.04,0,0.03,0,0.08,0,7.6999999999999999E-2,0,0,0.122,0,0,0,0.05,0,0]
[11,null,"Goltix Queen (jämförs mot led 6)","Daphna ",97.168000000000006,94.656999999999996,16.079000000000001,15.225,116.55056265788868,87.003,4.1139999999999999,15,10,0.625,3.1629999999999998,1.85,0.125,9.375,0,5.625,0,0,0.625,3.0000000000000001E-3,1.7999999999999999E-2,1.4999999999999999E-2,0.97499999999999998,1.9E-2,1.944,3.7999999999999999E-2,0.14799999999999999,0,0.05,0.15,0.8,0,0.04,0,0,0.625,0,0.125,0,0,0,0]
[14,null,"Safari Duo","Daphna ",99.608999999999995,95.536000000000001,16.091999999999999,15.379,117.72946490086503,86.691999999999993,3.95,15.5,10.625,0,1.6879999999999999,0.86299999999999999,0.05,9.375,0.125,6.875,0.125,0,0,0,3.0000000000000001E-3,6.7000000000000004E-2,0.40600000000000003,7.4999999999999997E-2,1.081,0.02,3.7999999999999999E-2,0,0.03,0.02,0.222,0,0,0,0,0.53200000000000003,0,0,0,0.05,0,0]
["LSD",null,null,null,"ns",5.9409999999999998,0.27,0.91200000000000003,null,1.1240000000000001,"ns",1.726,2.403,1.58,8.8610000000000007,6.0179999999999998,1.9350000000000001,2.3570000000000002,0.76900000000000002,3.286,"ns",null,"ns",0.23499999999999999,0.68500000000000005,0.222,2.0680000000000001,4.6399999999999997,3.6850000000000001,0.47899999999999998,1.4710000000000001,null,0.47599999999999998,0.17100000000000001,1.7050000000000001,null,4.7119999999999997,null,null,1.4830000000000001,null,1.494,null,0.32800000000000001]
["CV",null,null,null,4.2229999999999999,6.9240000000000004,1.738,6.5140000000000002,null,1.3720000000000001,7.806,11.917999999999999,28.401,344.23700000000002,161.626,138.23500000000001,230.47200000000001,29.216000000000001,146.57400000000001,86.105999999999995,370.26600000000002,300,481.93200000000002,154.065,346.01600000000002,264.17899999999997,219.297,305.815,206.60599999999999,238.459,275.27100000000002,300,295.827,231.79499999999999,299.12599999999998,288.67271156246557,378.95800000000003,300,254.36697506002969,129.642,300.00000000000006,306.17,300,271.91199999999998,300,300.00000000000006]
["P_value",null,null,null,9.7845076786554186E-2,"<0,0001","<0,0001","<0,0001",null,"<0,0001",0.24979473138675423,"<0.001","<0,0001","<0.05","<0,0001","<0,0001","<0,0001","<0,0001","<0,0001","<0,0001",0.13149490357981686,null,0.62604534855105753,"<0,0001","<0,0001","<0,0001","<0,0001","<0,0001","<0,0001","<0,0001","<0,0001",null,"<0,0001","<0,0001","<0.05",null,"<0.001",null,null,"<0,0001",null,"<0.001",null,"<0,0001"]

{"sheet":"Soil samples","index":15,"n_rows":42,"n_cols":15,"rows_kept":42,"cut":false,"hidden":false,"merged":[]}
["536 Program för ogräsbekämpning",null,null,null,null,null,null,null,null,null,null,null,"536-2019"]
[]
["Soil Analysis"]
["Trial number",null,"101 Borg",null,"102 St U",null,"103 Alna",null,"104 Laxm",null,"105 Resl",null," ",null," "]
[null,null,null,"Klass",null,"Klass",null,"Klass",null,"Klass",null,"Klass"]
["pH-värde",null,6.1,null,7.2,null,6.9,null,7.6]
["P-AL (mg/100 g jord)",null,13.7,"IVB",8.4,"IVA",8.4,"V",10.7,"IVA"]
["K-AL (mg/100 g jord)",null,7.8,"II",12.5,"III",12.9,"III",10,"III"]
["Mg-AL (mg/100 g jord)",null,5.4,null,8.4,null,7.3,null,9.1]
["K/Mg-kvot",null,1.4444444444444444,null,1.4880952380952381,null,1.7671232876712331,null,1.098901098901099]
["Ca-AL (mg/kg jord)",null,165,null,302,null,349,null,530]
["K-HCl (mg/100 g jord)"]
["Cu-HCl (mg/kg jord)"]
["P-HCL (mg/100 g)"]
["Boron (mg/kg soil)"]
["Organic matter (%)",null,2.2846023426101421,null,3.0744867562838101,null,2.9771158933747182,null,2.2569151567309822]
["Clay (%)",null,9.8985828738115966,null,14.4118528196657,null,8.0954344469605601,null,18.305480066100621]
["Fine clay",null,null,null,null,null,null,null,25]
["Sand+fine sand (%)",null,59.819321119071304,null,56.6811388598178,null,58.435794811920289,null,54.015766935420444]
["Soil type",null,"nmh l Mo",null,"mmh l Mo",null,"nmh l Mo",null,"nmh sa LL"]
["Base saturation (%)"]
["S-värde (mekv/100 g)"]
["T-värde (mekv/100 g)"]
["Need for Liming (ton CaO/ha)"]
["Nematoder, antal/g jord",null,0,null,0.3,null,0]
["Nematodes, no/g soil",null,null,null,null,null,null," "]
["Isolerade svampar i fält"]
["Isolated fungi (plants in field)"]
["DSI (Disease Severity Index), 0-100",null,65,null,44,null,36]
[]
[]
["Explanation"]
["Particle size",null,null,"Soil type"]
["Sand","Sand = 2-0,2 mm",null,"nmhlSa = medium humus rich light sand"]
["Grovmo","Fine sand = 0,02-0,06 mm",null,"mmhlSa = humus rich light sand"]
["Finmo","Coarse silt = 0,06-0,02 mm",null,"mmhlMo = humus rich fine sand soil"]
["Mjäla","Silt = 0,02-0,002",null,"mmhmoLL = humus rich loam soil"]
["Lera","Clay = <0,002 mm",null,"mfsaLL = humus poor sandy loam soil"]
["Finler","Fine clay = <0,0006",null,"mflSa = humus poor clay sand soil"]
[null,null,null,"mf lMo = humus poor fine sand"]
[null,null,null,"mf moLL = humus poor loam soil"]
[null,null,null,"nmhsaLL = medium humus rich sandy loam soil"]

{"sheet":"Field protocol","index":16,"n_rows":73,"n_cols":7,"rows_kept":73,"cut":false,"hidden":false,"merged":[]}
[null,101,"Borgeby","536 Pro EJ plats 101",null,"Borgeby"]
[536,101,"Borgeby","2.16 Parcellvis sådd (ej fröbyte) (101)",null,"2019-04-04T06:00:00","OL PW"]
[536,101,"Borgeby","9.1 Parcellsprutning, per spruttillfälle (101)","T0 Centium 3-5d efter sådd (led 13)","2019-04-10T06:00:00","HOJ"]
[536,101,"Borgeby","9.1 Parcellsprutning, per spruttillfälle (101)","(1) Behandling BBCH 12","2019-04-26T06:00:00","PW"]
[536,101,"Borgeby","9.1 Parcellsprutning, per spruttillfälle (101)","(2) Behandling","2019-05-05T06:00:00","PW"]
[536,101,"Borgeby","9.1 Parcellsprutning, per spruttillfälle (101)","(3) Behandling","2019-05-18T06:00:00","JM"]
[536,101,"Borgeby","10.11 Fytotox (Bayerskala) (101)","TII+10d","2019-05-22"," JM"]
[536,101,"Borgeby","5.4 Slutgiltig inkl. dubletter och pellar (101)",null,"2019-05-22"," AL"]
[536,101,"Borgeby","9.1 Parcellsprutning, per spruttillfälle (101)","(4) Behandling","2019-05-28T06:00:00","JL"]
[536,101,"Borgeby","7.1 Tot + domin, parcel (MT) (101)","TIV+14d","2019-06-13","MN"]
[536,101,"Borgeby","10.11 Fytotox (Bayerskala) (101)","TIV+14d","2019-06-14"," RM"]
[536,101,"Borgeby","7.1 Tot + domin, parcel (MT) (101)",null,"2019-07-30T06:00:00","MN"]
[536,101,"Borgeby","8.1 Tot + domin, parcel (MT U+ÖB) (101)",null,"2019-07-30T06:00:00","MN"]
[null,102,"St Uppåkra","536 Pro EJ plats 102",null,"Gamlegård"]
[536,102,"St Uppåkra","2.16 Parcellvis sådd (ej fröbyte) (102)",null,"2019-04-09T06:00:00","ES PW"]
[536,102,"St Uppåkra","9.1 Parcellsprutning, per spruttillfälle (102)","T0 Centium 3-5d efter sådd (led 13)","2019-04-17T06:00:00","PW"]
[536,102,"St Uppåkra","9.1 Parcellsprutning, per spruttillfälle (102)","(1) Behandling","2019-04-29","PW"]
[536,102,"St Uppåkra","9.1 Parcellsprutning, per spruttillfälle (102)","(2) Behandling","2019-05-08T06:00:00","PW"]
[536,102,"St Uppåkra","9.1 Parcellsprutning, per spruttillfälle (102)","(3) Behandling","2019-05-15T06:00:00","ES PW"]
[536,102,"St Uppåkra","10.11 Fytotox (Bayerskala) (102)","TII+10d","2019-05-23"," JM"]
[536,102,"St Uppåkra","9.1 Parcellsprutning, per spruttillfälle (102)","(4) Behandling","2019-05-24T06:00:00","JL"]
[536,102,"St Uppåkra","7.1 Tot + domin, parcel (MT) (102)","TIV+14d","2019-06-11","MN"]
[536,102,"St Uppåkra","10.11 Fytotox (Bayerskala) (102)","TIV+14d","2019-06-11"," RM"]
[536,102,"St Uppåkra","5.4 Slutgiltig inkl. dubletter och pellar (102)",null,"2019-06-18"," ALU"]
[536,102,"St Uppåkra","7.1 Tot + domin, parcel (MT) (102)",null,"2019-07-29T06:00:00","MN"]
[536,102,"St Uppåkra","8.1 Tot + domin, parcel (MT U+ÖB) (102)",null,"2019-07-29T06:00:00","MN"]
[536,102,"St Uppåkra","12.2 Besiktning inför skörd (102)",null,"2019-09-09T06:00:00","JE"]
[536,102,"St Uppåkra","13.8 Skörd av parcell (102)","Skörda led 2+ 4+5+6+7+8+11+14","2019-09-24","OL JM PL"]
[null,103,"Alnarp","536 Pro EJ plats 103",null,"Alnarp"]
[536,103,"Alnarp","2.16 Parcellvis sådd (ej fröbyte) (103)",null,"2019-04-08T06:00:00","ES PW"]
[536,103,"Alnarp","9.1 Parcellsprutning, per spruttillfälle (103)","T0 Centium 3-5d efter sådd (led 13)","2019-04-17T06:00:00","PW"]
[536,103,"Alnarp","9.1 Parcellsprutning, per spruttillfälle (103)","(1) Behandling","2019-04-29","PW"]
[536,103,"Alnarp","9.1 Parcellsprutning, per spruttillfälle (103)","(2) Behandling","2019-05-07T06:00:00","PW"]
[536,103,"Alnarp","9.1 Parcellsprutning, per spruttillfälle (103)","(3) Behandling","2019-05-18T06:00:00","PW"]
[536,103,"Alnarp","10.11 Fytotox (Bayerskala) (103)","TII+10d","2019-05-22"," JM"]
[536,103,"Alnarp","5.4 Slutgiltig inkl. dubletter och pellar (103)",null,"2019-05-22"," AL"]
[536,103,"Alnarp","9.1 Parcellsprutning, per spruttillfälle (103)","(4) Behandling","2019-05-28T06:00:00","PW"]
[536,103,"Alnarp","10.11 Fytotox (Bayerskala) (103)","TIV+14d","2019-06-13"," RM"]
[536,103,"Alnarp","7.1 Tot + domin, parcel (MT) (103)","TIV+14d","2019-06-13T06:00:00","MN"]
[536,103,"Alnarp","7.1 Tot + domin, parcel (MT) (103)",null,"2019-07-29","MN"]
[536,103,"Alnarp","8.1 Tot + domin, parcel (MT U+ÖB) (103)",null,"2019-07-29T06:00:00","MN"]
[536,103,"Alnarp","12.2 Besiktning inför skörd (103)",null,"2019-09-19T06:00:00","JE"]
[536,103,"Alnarp","13.8 Skörd av parcell (103)","Skörda led 1+ 2+ 4+5+6+7+8+11+14","2019-11-06","OL EMN RM"]
[null,104,"Laxman","536 Pro EJ plats 104",null,"Laxmans Åkarp"]
[536,104,"Laxman","2.16 Parcellvis sådd (ej fröbyte) (104)",null,"2019-04-06T06:00:00","Ol EMN"]
[536,104,"Laxman","9.1 Parcellsprutning, per spruttillfälle (104)","T0 Centium 3-5d efter sådd (led 13)","2019-04-13T06:00:00","JM"]
[536,104,"Laxman","9.1 Parcellsprutning, per spruttillfälle (104)","(1) Behandling","2019-04-26T06:00:00","PW"]
[536,104,"Laxman","9.1 Parcellsprutning, per spruttillfälle (104)","(2) Behandling","2019-05-03T06:00:00","JL"]
[536,104,"Laxman","9.1 Parcellsprutning, per spruttillfälle (104)","(3) Behandling","2019-05-15T06:00:00","PW"]
[536,104,"Laxman","9.1 Parcellsprutning, per spruttillfälle (104)","(4) Behandling","2019-05-24T06:00:00","JL"]
[536,104,"Laxman","10.11 Fytotox (Bayerskala) (104)","TII+10d","2019-05-25"," JM"]
[536,104,"Laxman","7.1 Tot + domin, parcel (MT) (104)","TIV+14d","2019-06-12","MN"]
[536,104,"Laxman","10.11 Fytotox (Bayerskala) (104)","TIV+14d","2019-06-12"," RM"]
[536,104,"Laxman","5.4 Slutgiltig inkl. dubletter och pellar (104)",null,"2019-06-18"," ALU"]
[536,104,"Laxman","7.1 Tot + domin, parcel (MT) (104)",null,"2019-07-30T06:00:00","MN"]
[536,104,"Laxman","8.1 Tot + domin, parcel (MT U+ÖB) (104)",null,"2019-07-30T06:00:00","MN"]
[536,104,"Laxman","12.2 Besiktning inför skörd (103)",null,"2019-09-09T06:00:00","JE"]
[536,104,"Laxman","13.8 Skörd av parcell (103)","Skörda led 2+ 4+5+6+7+8+11+14","2019-10-31","Ol JM RM"]
[null,105,"Reslöv","536 Pro EJ plats 105",null,"Reslöv"]
[536,105,"Reslöv","2.16 Parcellvis sådd (ej fröbyte) (105)",null,"2019-04-10T06:00:00","ES PW"]
[536,105,"Reslöv","9.1 Parcellsprutning, per spruttillfälle (105)","T0 Centium 3-5d efter sådd (led 13)","2019-04-18T06:00:00","pw"]
[536,105,"Reslöv","9.1 Parcellsprutning, per spruttillfälle (105)","(1) Behandling","2019-04-29T06:00:00","HOJ"]
[536,105,"Reslöv","9.1 Parcellsprutning, per spruttillfälle (105)","(2) Behandling","2019-05-08T06:00:00","HOJ"]
[536,105,"Reslöv","9.1 Parcellsprutning, per spruttillfälle (105)","(3) Behandling","2019-05-18T06:00:00","JM"]
[536,105,"Reslöv","10.11 Fytotox (Bayerskala) (105)","TII+10d","2019-05-25"," JM"]
[536,105,"Reslöv","9.1 Parcellsprutning, per spruttillfälle (105)","(4) Behandling","2019-05-27T06:00:00","HOJ"]
[536,105,"Reslöv","8.1 Tot + domin, parcel (MT U+ÖB) (105)",null,"2019-05-27T06:00:00","MN"]
[536,105,"Reslöv","5.4 Slutgiltig inkl. dubletter och pellar (105)",null,"2019-06-11"," ALU"]
[536,105,"Reslöv","7.1 Tot + domin, parcel (MT) (105)","TIV+14d","2019-06-13","MN"]
[536,105,"Reslöv","10.11 Fytotox (Bayerskala) (105)","TIV+14d","2019-06-13"," RM"]
[536,105,"Reslöv","7.1 Tot + domin, parcel (MT) (105)",null,"2019-07-30T06:00:00","MN"]
[536,105,"Reslöv","12.2 Besiktning inför skörd (105)",null,"2019-09-09T06:00:00","JE"]
[536,105,"Reslöv","13.8 Skörd av parcell (105)","Skörda led 1+ 2+ 4+5+6+7+8+11+14","2019-11-07","OL JM EMN"]

{"sheet":"102 RP1 St U (2)","index":17,"n_rows":17,"n_cols":19,"rows_kept":17,"cut":false,"hidden":false,"merged":[]}
[]
[]
[]
[]
[null,"102 St Uppåkra, Lars-Åke Bengtsson, tel:  (126)"]
[]
["Block4",11,"x",2,"x",7,8,10,1,13,5,6,9,4,14,"x",3,"x",12]
[null,102043,null,102044,null,102045,102046,102047,102048,102049,102050,102051,102052,102053,102054,null,102055,null,102056]
[]
["Block3",4,1,"x",3,"x",6,8,11,5,9,13,7,14,"x",2,"x",12,10]
[null,102029,102030,null,102031,null,102032,102033,102034,102035,102036,102037,102038,102039,null,102040,null,102041,102042]
[]
["Block2",6,5,"x",2,"x",12,11,9,14,4,10,13,7,"x",3,"x",8,1]
[null,102015,102016,null,102017,null,102018,102019,102020,102021,102022,102023,102024,102025,null,102026,null,102027,102028]
[]
["Block1",10,"x",3,"x",1,11,8,4,7,6,13,9,"x",2,"x",14,12,5]
[null,102001,null,102002,null,102003,102004,102005,102006,102007,102008,102009,102010,null,102011,null,102012,102013,102014]

{"sheet":"105 RP1 Resl","index":18,"n_rows":13,"n_cols":19,"rows_kept":13,"cut":false,"hidden":false,"merged":[]}
[]
[]
[]
[]
[null,"105 Reslöv, Magnus Vigre, tel: 708361254 (268)"]
["Block4",11,"x",2,"x",4,7,6,9,12,14,8,"x",3,"x",1,10,13,5]
[null,43,null,44,null,45,46,47,48,49,50,51,null,52,null,53,54,55,56]
["Block3","x",3,"x",9,1,14,13,12,6,7,"x",2,"x",10,5,8,4,11]
[null,null,29,null,30,31,32,33,34,35,36,null,37,null,38,39,40,41,42]
["Block2","x",2,"x",14,9,11,6,8,12,10,"x",3,"x",1,13,4,7,5]
[null,null,15,null,16,17,18,19,20,21,22,null,23,null,24,25,26,27,28]
["Block1",14,"x",3,"x",10,6,7,11,13,"x",2,"x",4,1,5,9,8,12]
[null,1,null,2,null,3,4,5,6,7,null,8,null,9,10,11,12,13,14]

{"sheet":"104 RP1 Laxm","index":19,"n_rows":13,"n_cols":19,"rows_kept":13,"cut":false,"hidden":false,"merged":[]}
[]
[]
[]
[]
[null,"104 Laxman, Hans Laxmar, tel: 0708-47 04 90 (76)"]
["Block4",10,9,8,12,"x",3,"x",14,11,5,6,7,4,13,"x",2,"x",1]
[null,43,44,45,46,null,47,null,48,49,50,51,52,53,54,null,55,null,56]
["Block3",6,5,1,"x",3,"x",7,8,4,14,12,13,11,"x",2,"x",9,10]
[null,29,30,31,null,32,null,33,34,35,36,37,38,39,null,40,null,41,42]
["Block2",9,1,12,"x",3,"x",5,7,6,13,4,11,10,"x",2,"x",8,14]
[null,15,16,17,null,18,null,19,20,21,22,23,24,25,null,26,null,27,28]
["Block1",7,13,"x",2,"x",14,8,11,5,6,9,12,1,4,"x",3,"x",10]
[null,1,2,null,3,null,4,5,6,7,8,9,10,11,12,null,13,null,14]

{"sheet":"103 RP1 Alna","index":20,"n_rows":13,"n_cols":19,"rows_kept":13,"cut":false,"hidden":false,"merged":[]}
[]
[]
[]
[]
[null,"103 Alnarp, Leif Bengtsson, tel: 073 801 52 25 (128)"]
["Block4",1,7,14,12,4,"x",3,"x",9,6,13,10,8,11,"x",2,"x",5]
[null,43,44,45,46,47,null,48,null,49,50,51,52,53,54,null,55,null,56]
["Block3",14,12,9,10,"x",2,"x",11,7,1,6,5,4,8,13,"x",3,"x"]
[null,29,30,31,32,null,33,null,34,35,36,37,38,39,40,41,null,42]
["Block2",13,4,14,8,"x",3,"x",7,10,9,12,6,1,5,11,"x",2,"x"]
[null,15,16,17,18,null,19,null,20,21,22,23,24,25,26,27,null,28]
["Block1",5,12,4,"x",2,"x",7,9,1,11,14,8,13,10,"x",3,"x",6]
[null,1,2,3,null,4,null,5,6,7,8,9,10,11,12,null,13,null,14]

{"sheet":"102 RP1 St U","index":21,"n_rows":13,"n_cols":19,"rows_kept":13,"cut":false,"hidden":false,"merged":[]}
[]
[]
[]
[]
[null,"102 St Uppåkra, Lars-Åke Bengtsson, tel:  (126)"]
["Block4",11,"x",2,"x",7,8,10,1,13,5,6,9,4,14,"x",3,"x",12]
[null,43,null,44,null,45,46,47,48,49,50,51,52,53,54,null,55,null,56]
["Block3",4,1,"x",3,"x",6,8,11,5,9,13,7,14,"x",2,"x",12,10]
[null,29,30,null,31,null,32,33,34,35,36,37,38,39,null,40,null,41,42]
["Block2",6,5,"x",2,"x",12,11,9,14,4,10,13,7,"x",3,"x",8,1]
[null,15,16,null,17,null,18,19,20,21,22,23,24,25,null,26,null,27,28]
["Block1",10,"x",3,"x",1,11,8,4,7,6,13,9,"x",2,"x",14,12,5]
[null,1,null,2,null,3,4,5,6,7,8,9,10,null,11,null,12,13,14]

{"sheet":"101 RP1 Borg","index":22,"n_rows":13,"n_cols":19,"rows_kept":13,"cut":false,"hidden":false,"merged":[]}
[]
[]
[]
[]
[null,"101 Borgeby, Leif Bengtsson, tel: 073 801 52 25 (27)"]
["Block4",14,5,7,6,"x",3,"x",10,8,12,"x",2,"x",9,13,11,1,4]
[null,43,44,45,46,null,47,null,48,49,50,null,51,null,52,53,54,55,56]
["Block3",13,7,4,"x",2,"x",11,10,1,5,12,"x",3,"x",9,8,6,14]
[null,29,30,31,null,32,null,33,34,35,36,37,null,38,null,39,40,41,42]
["Block2",1,6,7,"x",3,"x",4,9,8,14,10,"x",2,"x",11,12,5,13]
[null,15,16,17,null,18,null,19,20,21,22,23,null,24,null,25,26,27,28]
["Block1",10,8,"x",3,"x",5,11,1,12,6,13,14,"x",2,"x",4,7,9]
[null,1,2,null,3,null,4,5,6,7,8,9,10,null,11,null,12,13,14]